program: Gaussian 09
title: 000066347
version: EM64L-G09RevD.01
frameworkgroup: C1[X(C10H16N2O4)]
method: RPBEPBE
basis: SDD
operation: Freq
keyword: #p
keyword: freq=noraman
keyword: PBEPBE/SDD
title: #p freq=noraman PBEPBE/SDD
converged: YES YES NO NO
title: Mulliken charges:
elementType: O O O O N N C C C C C C C C C C H H H H H H H H H H H H H H H H
charge: -0.238174 -0.234512 -0.238084 -0.234424 -0.175284 -0.175291 -0.388584 -0.388785 0.271042 0.222210 0.270882 0.222108 -0.737087 -0.789717 -0.737101 -0.789647 0.232004 0.316390 0.316609 0.231975 0.262137 0.244255 0.253294 0.250880 0.275158 0.236016 0.262243 0.244280 0.253172 0.250872 0.275133 0.236030
chargesum: 0.00000
title: Mulliken charges with hydrogens summed into heavy atoms:
elementType: O O O O N N C C C C C C C C C C
charge: -0.238174 -0.234512 -0.238084 -0.234424 -0.175284 -0.175291 0.159809 0.159799 0.271042 0.222210 0.270882 0.222108 0.022598 -0.027663 0.022593 -0.027612
polarizability: 1.61568007e+02 -1.26870680e-03 1.43963103e+02 9.13371571e+00 -4.24193450e-03 9.90754829e+01
1716.lowfreq: -2.5758 -0.0003 0.0004 0.0008 6.0233 12.3719 17.6884 39.0935 44.6239
frequency: 17.6535 39.0649 44.6235 51.3117 68.9646 80.9534 81.1217 121.0795 140.8903 200.3957 201.8699 209.8674 210.3779 250.1066 265.7560 330.4879 365.5367 367.2435 369.8657 394.8273 397.2438 411.1337 413.1798 528.2791 546.7785 555.5313 556.6133 595.4641 602.0934 619.9556 621.9710 672.7044 721.7385 794.0305 890.3874 933.0124 970.8849 974.5538 987.9766 1007.2524 1028.3761 1031.1025 1039.4788 1040.2329 1045.4409 1097.3749 1120.0354 1123.8116 1197.2651 1229.4373 1246.1785 1253.4226 1317.5494 1331.6233 1340.2017 1375.3596 1379.7911 1384.8904 1390.9401 1391.2586 1428.2849 1428.5644 1444.9137 1445.1384 1447.0304 1447.0733 1469.9229 1470.8204 1484.3704 1485.6259 1603.8290 1606.5397 1612.7970 1615.6444 2994.3746 2994.4798 3011.7971 3011.8107 3065.5274 3073.9934 3080.7310 3080.8940 3102.1656 3102.2128 3126.8237 3131.0833 3131.4640 3131.6375 3132.2695 3143.4456
redmass: 4.7625 7.1638 4.1958 3.7170 4.3749 3.5936 3.4659 4.3485 6.7791 1.1404 1.0430 1.0403 1.0401 5.0824 4.7323 4.3267 2.6396 3.6615 2.6296 3.7970 4.7195 3.6643 4.2602 3.9537 3.7582 3.0246 2.8942 4.7602 3.1207 3.1694 3.6913 4.0089 2.5000 1.8171 3.5486 2.5627 2.0794 2.0837 1.6513 2.3508 1.7125 1.7060 1.7915 1.7158 2.7305 2.3360 4.0201 3.9666 1.8498 3.1502 4.6740 2.5480 1.2698 1.5602 2.1250 1.2506 1.2252 1.1994 1.2118 1.2165 1.0947 1.0939 1.0746 1.0683 1.0519 1.0518 1.0525 1.0779 1.0967 1.0663 6.4176 6.6916 9.1734 9.3905 1.0380 1.0382 1.0357 1.0357 1.0603 1.0605 1.0973 1.0973 1.0959 1.0959 1.1016 1.1001 1.1030 1.1021 1.0987 1.1052
irintensity: 0.9913 0.6509 7.0046 7.4020 2.0269 2.6982 0.4509 4.6875 1.0838 0.4884 0.2286 0.7183 0.4724 7.8984 9.6469 10.3242 1.8952 0.5208 0.8157 1.2786 1.7725 2.1427 0.2604 34.3357 6.5385 5.8853 9.3812 9.2695 5.2488 15.0246 7.2466 2.0789 0.5978 37.2789 3.6510 0.4740 14.2595 120.7082 16.9751 5.2264 2.9980 8.0267 4.8593 16.1541 0.2456 4.4898 4.8048 16.8797 409.9636 161.2948 79.6215 90.4035 30.7866 32.4638 297.9857 25.8138 38.2643 35.6405 103.8545 3.2434 19.9314 48.5527 55.5588 21.1311 24.3950 14.5960 39.7032 1.6840 8.9726 1.8353 142.3638 31.9845 372.6964 197.5003 1.1700 9.3861 3.0401 3.3773 1.8000 17.7374 4.4545 17.0898 4.4109 5.0978 4.3173 1.0737 19.0338 24.2319 9.8164 1.0891
temp: 298.150 k
press: 1.00000 atm
elementType: 8 8 8 8 7 7 6 6 6 6 6 6 6 6 6 6 1 1 1 1 1 1 1 1 1 1 1 1 1 1 1 1
symmnumber: 1
zpe: 671594.4 jmol-1
zpe.correction: 0.255797 hartree
zpe.thermalcorrener: 0.273940 hartree
zpe.thermalcorrenthalpy: 0.274885 hartree
zpe.thermalcorrgfe: 0.207707 hartree
zpe.sumelectzpe: -799.847925 hartree
zpe.sumelectthermal: -799.829782 hartree
zpe.sumelectthermalent: -799.828837 hartree
zpe.sumelectthermalfe: -799.896015 hartree
dipole: -0.0011 2.9749 0.0051
dipole: 2.9749
quadrupole: -106.8052 -108.5619 -89.1968
quadrupole: -0.0005 -3.4604 0.0023
quadrupole: -5.2839 -7.0406 12.3245 -0.0005 -3.4604 0.0023
hfenergy: -800.1037221 hartree
pointgroup: C01 [X(C10H16N2O4)]
dipole: -0.0049044 -1.1704107 -0.0004209 debye
polarizability: 161.1698598|-0.0780238|143.9633547|-10.3985381|-0.0248244|99.4733785 unknown
InChI: InChI=1S/C10H16N2O4/c1-7(13)11(8(2)14)5-6-12(9(3)15)10(4)16/h5-6H2,1-4H3
charge 0 multiplicity 1
32 atoms
O  1.93648 2.109423 -0.740215
O  3.591389 -1.607504 0.118582
O  -1.919784 2.126115 0.733641
O  -3.598665 -1.582712 -0.113981
N  1.886852 0.012734 0.247721
N  -1.884522 0.026924 -0.24976
C  0.478688 0.351046 0.614544
C  -0.474305 0.354832 -0.617621
C  2.590699 1.07487 -0.433563
C  2.454231 -1.26257 0.543395
C  -2.580934 1.095224 0.429594
C  -2.460205 -1.245656 -0.541455
C  4.069178 0.948612 -0.730398
C  1.637739 -2.215355 1.416045
C  -4.060152 0.979459 0.72697
C  -1.65132 -2.204744 -1.414247
H  0.12143 -0.374654 1.358681
H  0.460871 1.35369 1.067284
H  -0.449219 1.357469 -1.069894
H  -0.12272 -0.373006 -1.362373
H  4.257461 0.174936 -1.493469
H  4.412658 1.929434 -1.093951
H  4.6454 0.638202 0.156496
H  1.416974 -1.779482 2.407056
H  2.243233 -3.122908 1.553897
H  0.677416 -2.501278 0.950725
H  -4.253535 0.208499 1.491449
H  -4.397092 1.963308 1.088462
H  -4.638541 0.671307 -0.159353
H  -1.429253 -1.771337 -2.406028
H  -2.26283 -3.108553 -1.550128
H  -0.692125 -2.496325 -0.950105
