program: Orca
programVersion: 5.0.2
elementType: Br Cl S P O O O C C C C C C C C C C C H H H H H H H H H H H H H H H
charge: 0
multiplicity: 1
keywords: wb97x-d3
keywords: def2-TZVPP
keywords: def2/J RIJCOSX
keywords: DEFGRID2
keywords: scfconv7
keywords: smallprint printgap noloewdin
keywords: NOSOSCF
formula: C11H15BrClO3PS
InChI: InChI=1/C11H15BrClO3PS/c1-3-7-18-17(14,15-4-2)16-11-6-5-9(12)8-10(11)13/h5-6,8H,3-4,7H2,1-2H3
33 atoms
Br 4.309769 -0.88554 0.571805
Cl 0.099946 2.557167 1.420015
S  -2.583065 -1.161589 0.683334
P  -2.601951 0.181039 -0.891465
O  -1.25295 1.048659 -0.622181
O  -3.698738 1.292902 -0.639712
O  -2.732135 -0.410244 -2.240423
C  -3.417594 -2.613955 -0.076782
C  -2.48757 -3.518969 -0.86046
C  -1.354523 -4.108131 -0.038627
C  -0.009019 0.549782 -0.374537
C  -3.77883 2.076353 0.57601
C  0.757444 1.203264 0.584345
C  0.522445 -0.536892 -1.050805
C  -3.455201 3.518254 0.284596
C  2.046119 0.783567 0.868238
C  1.80677 -0.974284 -0.768723
C  2.557463 -0.311167 0.189603
H  -4.256279 -2.267283 -0.677763
H  -3.835938 -3.139279 0.782914
H  -3.110544 -4.326164 -1.256313
H  -2.091086 -2.987603 -1.726325
H  -0.666441 -3.337034 0.311321
H  -1.732454 -4.641725 0.835112
H  -0.776235 -4.815678 -0.632859
H  -4.798369 1.963812 0.941316
H  -3.111461 1.678192 1.343418
H  -0.050054 -1.043773 -1.816451
H  -2.43646 3.639262 -0.081655
H  -4.142956 3.942128 -0.446803
H  -3.549943 4.094495 1.205107
H  2.627444 1.310711 1.612168
H  2.203071 -1.821843 -1.310351
elementType: Br Cl S P O C H
totalener: -4428.05427298 hartree
nucrepener: 2262.44963582 hartree
electener: -6690.50390880 hartree
twoeener: 3946.19330150 hartree
cpcmener: -0.02532743 hartree
kineticenergy: 4419.41009494 hartree
xcener: -190.171329096465 hartree
chargesum: -0.0000000
charge: -0.029275 -0.064003 -0.184700 0.828253 -0.333304 -0.350229 -0.625126 -0.081530 -0.110107 -0.256520 0.217065 0.046088 0.019483 -0.194955 -0.248017 -0.059336 -0.083467 -0.068442 0.128740 0.131427 0.083403 0.068130 0.068717 0.090376 0.094260 0.117169 0.086354 0.159383 0.071778 0.098156 0.098902 0.130198 0.151129
qa: -0.0293 -0.0640 -0.1847 0.8283 -0.3333 -0.3502 -0.6251 -0.0815 -0.1101 -0.2565 0.2171 0.0461 0.0195 -0.1950 -0.2480 -0.0593 -0.0835 -0.0684 0.1287 0.1314 0.0834 0.0681 0.0687 0.0904 0.0943 0.1172 0.0864 0.1594 0.0718 0.0982 0.0989 0.1302 0.1511
va: 1.2233 1.2499 2.2681 5.4877 2.1180 2.1178 1.9730 3.8395 3.8935 3.9237 3.7534 3.8347 3.9861 3.9603 3.9269 3.9033 3.8803 3.9963 1.0214 1.0048 1.0111 1.0220 1.0108 1.0015 1.0045 0.9981 1.0055 1.0033 1.0219 1.0054 1.0052 1.0090 0.9933
dispcorr: -0.018375491 hartree
energy: -4428.072648470185
dipole: -65.40904 64.92522 -0.48382 -6.06061 5.49357 -0.56704 -7.52491 9.03258 1.50767
magnitude: 1.68187 au
magnitude: 4.27497 debye
