program: Orca
programVersion: 5.0.2
elementType: Br Cl S P O O O C C C C C C C C C C C H H H H H H H H H H H H H H H
charge: 0
multiplicity: 1
keywords: wb97x-d3
keywords: def2-TZVPP
keywords: def2/J RIJCOSX
keywords: DEFGRID2
keywords: scfconv7
keywords: smallprint printgap noloewdin
keywords: NOSOSCF
formula: C11H15BrClO3PS
InChI: InChI=1/C11H15BrClO3PS/c1-3-7-18-17(14,15-4-2)16-11-6-5-9(12)8-10(11)13/h5-6,8H,3-4,7H2,1-2H3
33 atoms
Br 4.609251 0.665549 1.334252
Cl 0.25113 2.523242 -1.474062
S  -2.244109 -1.927181 0.419053
P  -2.075968 -0.226198 -0.733159
O  -0.62564 -0.275663 -1.469231
O  -1.859784 0.89271 0.367701
O  -3.125137 -0.029287 -1.756117
C  -2.867972 -3.125086 -0.829338
C  -4.381417 -3.143128 -0.93117
C  -5.075688 -3.529356 0.36327
C  0.554572 -0.070026 -0.805907
C  -2.913152 1.805593 0.761366
C  1.089146 1.211791 -0.74038
C  1.241608 -1.131592 -0.243952
C  -3.96981 1.133446 1.601759
C  2.300942 1.439055 -0.10919
C  2.453936 -0.920213 0.393331
C  2.96825 0.365086 0.460568
H  -2.486776 -4.089297 -0.491178
H  -2.394942 -2.916143 -1.788237
H  -4.740372 -2.17332 -1.278685
H  -4.635508 -3.86357 -1.713522
H  -4.724236 -4.495803 0.729094
H  -4.902941 -2.792914 1.149625
H  -6.15348 -3.602415 0.218367
H  -2.402702 2.583457 1.324923
H  -3.343255 2.264688 -0.129352
H  0.835063 -2.131481 -0.31322
H  -4.54129 0.395942 1.037508
H  -3.537107 0.646318 2.475278
H  -4.669678 1.891659 1.953613
H  2.702311 2.442605 -0.069386
H  2.977674 -1.760353 0.827689
elementType: Br Cl S P O C H
totalener: -4428.05335427 hartree
nucrepener: 2241.75783338 hartree
electener: -6669.81118765 hartree
twoeener: 3926.12930011 hartree
cpcmener: -0.02637397 hartree
kineticenergy: 4419.43381947 hartree
xcener: -190.174271763667 hartree
chargesum: -0.0000000
charge: -0.028632 -0.065336 -0.176369 0.830231 -0.362161 -0.342881 -0.624977 -0.093540 -0.098587 -0.258460 0.238472 0.043979 -0.007853 -0.177054 -0.252884 -0.054312 -0.090229 -0.067494 0.130156 0.127580 0.065851 0.078457 0.086530 0.073786 0.093091 0.107853 0.103366 0.158858 0.084257 0.092391 0.103834 0.131628 0.150447
qa: -0.0286 -0.0653 -0.1764 0.8302 -0.3622 -0.3429 -0.6250 -0.0935 -0.0986 -0.2585 0.2385 0.0440 -0.0079 -0.1771 -0.2529 -0.0543 -0.0902 -0.0675 0.1302 0.1276 0.0659 0.0785 0.0865 0.0738 0.0931 0.1079 0.1034 0.1589 0.0843 0.0924 0.1038 0.1316 0.1504
va: 1.2232 1.2470 2.2809 5.4752 2.1129 2.0952 1.9735 3.8403 3.9041 3.9266 3.7997 3.8347 3.9999 4.0320 3.9299 3.8979 3.8942 3.9947 1.0055 1.0196 1.0260 1.0097 1.0006 1.0111 1.0053 0.9903 1.0033 0.9982 1.0075 1.0024 1.0108 1.0081 0.9934
dispcorr: -0.017262738 hartree
energy: -4428.070617002735
dipole: -80.75471 80.58420 -0.17051 -25.77009 24.68672 -1.08337 -6.13619 7.46913 1.33294
magnitude: 1.72612 au
magnitude: 4.38746 debye
