program: Orca
programVersion: 5.0.2
elementType: Br Cl S P O O O C C C C C C C C C C C H H H H H H H H H H H H H H H
charge: 0
multiplicity: 1
keywords: wb97x-d3
keywords: def2-TZVPP
keywords: def2/J RIJCOSX
keywords: DEFGRID2
keywords: scfconv7
keywords: smallprint printgap noloewdin
keywords: NOSOSCF
formula: C11H15BrClO3PS
InChI: InChI=1/C11H15BrClO3PS/c1-3-7-18-17(14,15-4-2)16-11-6-5-9(12)8-10(11)13/h5-6,8H,3-4,7H2,1-2H3
33 atoms
Br 4.800662 -0.001652 0.173774
Cl -0.15044 1.497752 2.074148
S  -1.960893 -1.324051 0.658934
P  -2.181572 -0.050185 -0.960145
O  -1.050036 1.079961 -0.656727
O  -3.490931 0.824196 -0.813968
O  -2.094177 -0.68986 -2.289562
C  -2.269365 -2.976411 -0.081115
C  -3.708064 -3.448062 0.010309
C  -4.7045 -2.613428 -0.774018
C  0.271887 0.778801 -0.484998
C  -3.912444 1.485253 0.401511
C  0.839803 0.969305 0.769325
C  1.056313 0.339076 -1.537119
C  -3.552693 2.949477 0.384551
C  2.190297 0.741426 0.975519
C  2.407237 0.099406 -1.345216
C  2.962065 0.306358 -0.091579
H  -1.614043 -3.633478 0.490669
H  -1.903376 -2.970381 -1.106634
H  -3.713026 -4.474453 -0.367448
H  -4.00927 -3.507091 1.058272
H  -4.825811 -1.617358 -0.346729
H  -4.402742 -2.5006 -1.816389
H  -5.687189 -3.084807 -0.765015
H  -4.991438 1.348876 0.442428
H  -3.490571 0.983668 1.2755
H  0.617906 0.198574 -2.516355
H  -4.000958 3.42766 1.255753
H  -2.477488 3.113399 0.434279
H  -3.943598 3.445839 -0.503434
H  2.617093 0.901003 1.956626
H  3.007526 -0.240865 -2.177577
elementType: Br Cl S P O C H
totalener: -4428.05493438 hartree
nucrepener: 2262.99691707 hartree
electener: -6691.05185145 hartree
twoeener: 3947.18921204 hartree
cpcmener: -0.02467700 hartree
kineticenergy: 4419.42365454 hartree
xcener: -190.173553600145 hartree
chargesum: -0.0000000
charge: -0.028242 -0.062581 -0.193785 0.838450 -0.349099 -0.348802 -0.624308 -0.077555 -0.078940 -0.268851 0.214169 0.041309 -0.000512 -0.178442 -0.233360 -0.051162 -0.079211 -0.073082 0.128960 0.116682 0.075898 0.068210 0.067378 0.084065 0.100490 0.115363 0.093732 0.156602 0.098319 0.070394 0.092634 0.133703 0.151576
qa: -0.0282 -0.0626 -0.1938 0.8384 -0.3491 -0.3488 -0.6243 -0.0776 -0.0789 -0.2689 0.2142 0.0413 -0.0005 -0.1784 -0.2334 -0.0512 -0.0792 -0.0731 0.1290 0.1167 0.0759 0.0682 0.0674 0.0841 0.1005 0.1154 0.0937 0.1566 0.0983 0.0704 0.0926 0.1337 0.1516
va: 1.2235 1.2489 2.2955 5.4792 2.1134 2.1005 1.9831 3.8658 3.8732 3.9285 3.7856 3.8235 3.9903 4.0470 3.9463 3.8888 3.8854 3.9930 1.0034 1.0292 1.0097 1.0121 1.0082 1.0109 1.0081 0.9938 1.0047 1.0098 1.0061 1.0217 1.0061 1.0062 0.9922
dispcorr: -0.018065802 hartree
energy: -4428.073000186485
dipole: -78.89113 78.34466 -0.54647 -9.99403 9.64545 -0.34858 -6.09741 7.49243 1.39501
magnitude: 1.53825 au
magnitude: 3.90991 debye
