program: Orca
programVersion: 5.0.2
elementType: Br Cl S P O O O C C C C C C C C C C C H H H H H H H H H H H H H H H
charge: 0
multiplicity: 1
keywords: wb97x-d3
keywords: def2-TZVPP
keywords: def2/J RIJCOSX
keywords: DEFGRID2
keywords: scfconv7
keywords: smallprint printgap noloewdin
keywords: NOSOSCF
formula: C11H15BrClO3PS
InChI: InChI=1/C11H15BrClO3PS/c1-3-7-18-17(14,15-4-2)16-11-6-5-9(12)8-10(11)13/h5-6,8H,3-4,7H2,1-2H3
33 atoms
Br 4.597296 0.651568 1.339416
Cl 0.264646 2.508621 -1.507131
S  -2.268995 -1.877798 0.467935
P  -2.093115 -0.202868 -0.720986
O  -0.643523 -0.27943 -1.457147
O  -1.871519 0.936262 0.357196
O  -3.140259 -0.017923 -1.748326
C  -2.769105 -3.124466 -0.78875
C  -4.271627 -3.210598 -0.977366
C  -5.020367 -3.635835 0.273823
C  0.538036 -0.076187 -0.79528
C  -2.916597 1.866153 0.73381
C  1.086816 1.200479 -0.750341
C  1.21256 -1.135563 -0.214222
C  -3.96341 1.223576 1.608348
C  2.300416 1.424928 -0.121732
C  2.426718 -0.926968 0.4206
C  2.955906 0.353257 0.465653
H  -2.367845 -4.065577 -0.410929
H  -2.250662 -2.912798 -1.723503
H  -4.654657 -2.25717 -1.343754
H  -4.446723 -3.938452 -1.774364
H  -4.916481 -2.90377 1.076086
H  -6.085432 -3.745143 0.069956
H  -4.654679 -4.593773 0.647645
H  -2.39634 2.659703 1.265612
H  -3.356837 2.297751 -0.165556
H  0.796139 -2.132323 -0.26791
H  -4.544499 0.471596 1.073921
H  -3.519914 0.761553 2.490062
H  -4.656177 1.99411 1.947224
H  2.713224 2.42434 -0.099268
H  2.940203 -1.76537 0.870265
elementType: Br Cl S P O C H
totalener: -4428.05369260 hartree
nucrepener: 2242.00370308 hartree
electener: -6670.05739567 hartree
twoeener: 3926.34944301 hartree
cpcmener: -0.02667273 hartree
kineticenergy: 4419.43226437 hartree
xcener: -190.173944441724 hartree
chargesum: 0.0000000
charge: -0.028626 -0.065314 -0.175356 0.827631 -0.361775 -0.342503 -0.624787 -0.092791 -0.097871 -0.257539 0.238096 0.044947 -0.007094 -0.177573 -0.253776 -0.054777 -0.090660 -0.066652 0.129904 0.127162 0.065184 0.077391 0.073991 0.093217 0.085729 0.107171 0.103212 0.160093 0.085530 0.092325 0.103614 0.131626 0.150272
qa: -0.0286 -0.0653 -0.1754 0.8276 -0.3618 -0.3425 -0.6248 -0.0928 -0.0979 -0.2575 0.2381 0.0449 -0.0071 -0.1776 -0.2538 -0.0548 -0.0907 -0.0667 0.1299 0.1272 0.0652 0.0774 0.0740 0.0932 0.0857 0.1072 0.1032 0.1601 0.0855 0.0923 0.1036 0.1316 0.1503
va: 1.2232 1.2470 2.2818 5.4787 2.1100 2.0970 1.9752 3.8423 3.9080 3.9265 3.8023 3.8343 4.0011 4.0308 3.9284 3.8987 3.8953 3.9940 1.0050 1.0187 1.0266 1.0096 1.0117 1.0052 1.0005 0.9904 1.0035 0.9961 1.0085 1.0023 1.0106 1.0081 0.9937
dispcorr: -0.017215253 hartree
energy: -4428.070907848012
dipole: -80.06974 79.96864 -0.10110 -25.74356 24.66595 -1.07761 -6.41362 7.74836 1.33474
magnitude: 1.71843 au
magnitude: 4.36790 debye
