program: Orca
programVersion: 5.0.2
elementType: Br Cl S P O O O C C C C C C C C C C C H H H H H H H H H H H H H H H
charge: 0
multiplicity: 1
keywords: wb97x-d3
keywords: def2-TZVPP
keywords: def2/J RIJCOSX
keywords: DEFGRID2
keywords: scfconv7
keywords: smallprint printgap noloewdin
keywords: NOSOSCF
formula: C11H15BrClO3PS
InChI: InChI=1/C11H15BrClO3PS/c1-3-7-18-17(14,15-4-2)16-11-6-5-9(12)8-10(11)13/h5-6,8H,3-4,7H2,1-2H3
33 atoms
Br 4.940013 -0.034827 0.044184
Cl 0.025928 1.318873 2.140735
S  -1.902988 -1.316166 0.5361
P  -2.054182 0.056206 -1.003908
O  -0.918243 1.146594 -0.598555
O  -3.361413 0.9321 -0.837479
O  -1.950403 -0.516661 -2.364254
C  -2.682605 -2.774329 -0.260738
C  -4.181895 -2.657235 -0.456865
C  -4.963732 -2.513871 0.836608
C  0.407085 0.823555 -0.475669
C  -3.730824 1.596819 0.394569
C  0.994466 0.901312 0.781666
C  1.172724 0.471473 -1.573887
C  -5.226846 1.530559 0.547189
C  2.346791 0.649857 0.946814
C  2.52446 0.20828 -1.422762
C  3.099474 0.303286 -0.164777
H  -2.444554 -3.591007 0.422169
H  -2.161193 -2.969639 -1.195245
H  -4.41305 -1.832405 -1.135104
H  -4.496764 -3.567294 -0.975383
H  -4.777075 -3.357807 1.502983
H  -4.697406 -1.602358 1.373714
H  -6.034873 -2.476731 0.638732
H  -3.239913 1.120807 1.246487
H  -3.379074 2.626509 0.333113
H  0.722966 0.421379 -2.556007
H  -5.572983 0.500423 0.632038
H  -5.512359 2.056801 1.458024
H  -5.739437 2.006545 -0.288182
H  2.788237 0.720401 1.931656
H  3.109539 -0.061242 -2.290935
elementType: Br Cl S P O C H
totalener: -4428.05700286 hartree
nucrepener: 2246.51965444 hartree
electener: -6674.57665730 hartree
twoeener: 3930.59290119 hartree
cpcmener: -0.02558981 hartree
kineticenergy: 4419.42053166 hartree
xcener: -190.172264829974 hartree
chargesum: 0.0000000
charge: -0.027389 -0.060753 -0.194072 0.833379 -0.345854 -0.343255 -0.627565 -0.081448 -0.105938 -0.270851 0.206842 0.027388 -0.003752 -0.170374 -0.235403 -0.046621 -0.082639 -0.074799 0.128956 0.128341 0.066543 0.085466 0.097674 0.068146 0.100105 0.094782 0.116110 0.156728 0.086350 0.094084 0.095441 0.133028 0.151351
qa: -0.0274 -0.0608 -0.1941 0.8334 -0.3459 -0.3433 -0.6276 -0.0814 -0.1059 -0.2709 0.2068 0.0274 -0.0038 -0.1704 -0.2354 -0.0466 -0.0826 -0.0748 0.1290 0.1283 0.0665 0.0855 0.0977 0.0681 0.1001 0.0948 0.1161 0.1567 0.0864 0.0941 0.0954 0.1330 0.1514
va: 1.2239 1.2516 2.2927 5.4732 2.1188 2.0948 1.9830 3.8634 3.8755 3.9287 3.8055 3.8391 3.9901 4.0375 3.9487 3.8839 3.8893 3.9931 1.0022 1.0244 1.0227 1.0102 1.0030 1.0078 1.0024 0.9987 0.9971 1.0096 1.0027 1.0074 1.0045 1.0066 0.9925
dispcorr: -0.017790901 hartree
energy: -4428.074793763691
dipole: -87.13235 86.24943 -0.88292 -10.82897 10.55487 -0.27410 -1.39816 2.76994 1.37178
magnitude: 1.65423 au
magnitude: 4.20471 debye
