program: Orca
programVersion: 5.0.2
elementType: Br Cl S P O O O C C C C C C C C C C C H H H H H H H H H H H H H H H
charge: 0
multiplicity: 1
keywords: wb97x-d3
keywords: def2-TZVPP
keywords: def2/J RIJCOSX
keywords: DEFGRID2
keywords: scfconv7
keywords: smallprint printgap noloewdin
keywords: NOSOSCF
formula: C11H15BrClO3PS
InChI: InChI=1/C11H15BrClO3PS/c1-3-7-18-17(14,15-4-2)16-11-6-5-9(12)8-10(11)13/h5-6,8H,3-4,7H2,1-2H3
33 atoms
Br 4.377972 -1.056652 0.251823
Cl -0.160822 1.266426 2.324613
S  -2.680771 -0.589674 0.607273
P  -2.242273 0.625537 -1.00719
O  -0.998933 1.540437 -0.475412
O  -3.35315 1.737646 -1.169351
O  -1.966072 -0.090937 -2.271525
C  -2.979523 -2.220195 -0.19385
C  -1.849077 -3.199959 0.062048
C  -0.504731 -2.79341 -0.51596
C  0.2368 0.965386 -0.326277
C  -4.239603 2.238636 -0.144654
C  0.745118 0.763702 0.951162
C  0.991148 0.602031 -1.430094
C  -3.527887 3.008384 0.938925
C  1.985061 0.170774 1.131821
C  2.230141 0.006938 -1.26594
C  2.709838 -0.215752 0.015719
H  -3.150489 -2.06827 -1.257466
H  -3.911585 -2.580316 0.239267
H  -1.756241 -3.377945 1.13555
H  -2.165806 -4.15023 -0.376994
H  -0.570042 -2.594052 -1.586013
H  -0.109371 -1.901366 -0.029013
H  0.226604 -3.588834 -0.372427
H  -4.93286 2.882533 -0.681592
H  -4.808469 1.404583 0.268993
H  0.615929 0.790331 -2.426359
H  -4.278592 3.450437 1.594256
H  -2.892069 2.375848 1.5585
H  -2.923971 3.817195 0.528763
H  2.361541 0.013872 2.13353
H  2.8011 -0.275961 -2.139394
elementType: Br Cl S P O C H
totalener: -4428.05264189 hartree
nucrepener: 2313.63572326 hartree
electener: -6741.68836516 hartree
twoeener: 3998.15486188 hartree
cpcmener: -0.02456965 hartree
kineticenergy: 4419.43389728 hartree
xcener: -190.177748117910 hartree
chargesum: -0.0000000
charge: -0.027407 -0.061897 -0.195767 0.841816 -0.347823 -0.352428 -0.626152 -0.076651 -0.080179 -0.249754 0.230495 0.019128 0.012411 -0.186241 -0.229263 -0.056074 -0.082704 -0.068180 0.113044 0.130233 0.070123 0.077302 0.085365 0.039757 0.101380 0.114131 0.106976 0.151589 0.104539 0.065976 0.095079 0.130997 0.150178
qa: -0.0274 -0.0619 -0.1958 0.8418 -0.3478 -0.3524 -0.6262 -0.0767 -0.0802 -0.2498 0.2305 0.0191 0.0124 -0.1862 -0.2293 -0.0561 -0.0827 -0.0682 0.1130 0.1302 0.0701 0.0773 0.0854 0.0398 0.1014 0.1141 0.1070 0.1516 0.1045 0.0660 0.0951 0.1310 0.1502
va: 1.2234 1.2475 2.2925 5.4683 2.0898 2.1331 1.9750 3.8632 3.8932 3.9303 3.7712 3.8564 3.9777 3.9921 3.8971 3.8869 3.8608 3.9844 1.0337 1.0078 1.0112 1.0104 1.0080 1.0144 1.0098 0.9914 0.9991 1.0110 1.0112 1.0131 1.0058 1.0084 0.9933
dispcorr: -0.019753002 hartree
energy: -4428.072394894095
dipole: -62.44279 61.38076 -1.06203 2.18681 -2.41330 -0.22650 -6.07661 7.22679 1.15019
magnitude: 1.58182 au
magnitude: 4.02066 debye
