program: Orca
programVersion: 5.0.2
elementType: Br Cl S P O O O C C C C C C C C C C C H H H H H H H H H H H H H H H
charge: 0
multiplicity: 1
keywords: wb97x-d3
keywords: def2-TZVPP
keywords: def2/J RIJCOSX
keywords: DEFGRID2
keywords: scfconv7
keywords: smallprint printgap noloewdin
keywords: NOSOSCF
formula: C11H15BrClO3PS
InChI: InChI=1/C11H15BrClO3PS/c1-3-7-18-17(14,15-4-2)16-11-6-5-9(12)8-10(11)13/h5-6,8H,3-4,7H2,1-2H3
33 atoms
Br 4.465843 -0.463567 1.026597
Cl 0.613132 0.181037 -2.851417
S  -2.328921 -1.15234 0.879891
P  -2.52074 0.657452 -0.095478
O  -1.080033 1.089096 -0.699512
O  -2.655967 1.700315 1.094068
O  -3.542691 0.701861 -1.164063
C  -2.837383 -2.324037 -0.434153
C  -1.816467 -2.48986 -1.543088
C  -2.24508 -3.57915 -2.515636
C  0.156019 0.728737 -0.251291
C  -3.91611 1.868705 1.792863
C  1.074378 0.280622 -1.195875
C  0.538742 0.82604 1.076647
C  -4.735088 2.970051 1.171058
C  2.360814 -0.074298 -0.82451
C  1.820546 0.468903 1.463242
C  2.721122 0.019636 0.510403
H  -3.811116 -2.017785 -0.814864
H  -2.980629 -3.26124 0.106937
H  -1.697573 -1.54845 -2.082471
H  -0.843383 -2.732808 -1.111986
H  -2.337989 -4.544788 -2.016099
H  -3.207798 -3.348043 -2.974048
H  -1.515984 -3.69052 -3.318239
H  -4.466926 0.925298 1.811882
H  -3.641595 2.109846 2.817825
H  -0.149238 1.19388 1.82604
H  -4.179212 3.906874 1.133689
H  -5.061555 2.715121 0.163247
H  -5.625072 3.134492 1.779165
H  3.056718 -0.419121 -1.577384
H  2.095445 0.551852 2.505487
elementType: Br Cl S P O C H
totalener: -4428.05561903 hartree
nucrepener: 2247.23477760 hartree
electener: -6675.29039663 hartree
twoeener: 3931.30529174 hartree
cpcmener: -0.02673057 hartree
kineticenergy: 4419.40673995 hartree
xcener: -190.169811542235 hartree
chargesum: -0.0000000
charge: -0.028618 -0.066234 -0.173824 0.814941 -0.335084 -0.342009 -0.628925 -0.069517 -0.082006 -0.267172 0.218550 0.053598 0.000915 -0.170287 -0.244934 -0.051083 -0.099197 -0.067915 0.117848 0.128578 0.041627 0.070834 0.087321 0.086059 0.093076 0.091559 0.108331 0.165949 0.089109 0.079570 0.097577 0.130200 0.151163
qa: -0.0286 -0.0662 -0.1738 0.8149 -0.3351 -0.3420 -0.6289 -0.0695 -0.0820 -0.2672 0.2185 0.0536 0.0009 -0.1703 -0.2449 -0.0511 -0.0992 -0.0679 0.1178 0.1286 0.0416 0.0708 0.0873 0.0861 0.0931 0.0916 0.1083 0.1659 0.0891 0.0796 0.0976 0.1302 0.1512
va: 1.2237 1.2438 2.2931 5.4767 2.1146 2.1101 1.9777 3.8470 3.8872 3.9626 3.8024 3.8487 3.9591 3.9553 3.9406 3.9026 3.9145 4.0009 1.0234 1.0031 1.0332 1.0115 1.0008 1.0007 1.0038 1.0041 0.9917 1.0063 1.0044 1.0190 1.0070 1.0098 0.9937
dispcorr: -0.017550098 hartree
energy: -4428.073169125607
dipole: -72.26332 71.99918 -0.26414 -2.93540 2.19434 -0.74105 -7.18274 9.07246 1.88973
magnitude: 2.04695 au
magnitude: 5.20294 debye
