program: Orca
programVersion: 5.0.2
elementType: Br Cl S P O O O C C C C C C C C C C C H H H H H H H H H H H H H H H
charge: 0
multiplicity: 1
keywords: wb97x-d3
keywords: def2-TZVPP
keywords: def2/J RIJCOSX
keywords: DEFGRID2
keywords: scfconv7
keywords: smallprint printgap noloewdin
keywords: NOSOSCF
formula: C11H15BrClO3PS
InChI: InChI=1/C11H15BrClO3PS/c1-3-7-18-17(14,15-4-2)16-11-6-5-9(12)8-10(11)13/h5-6,8H,3-4,7H2,1-2H3
33 atoms
Br 4.78787 -0.096505 0.356662
Cl -0.130611 1.921825 1.804602
S  -1.90584 -1.37408 0.418752
P  -2.136185 -0.041748 -1.148939
O  -0.990285 1.062994 -0.823808
O  -3.444565 0.833811 -1.004435
O  -2.074045 -0.676406 -2.485251
C  -2.617011 -2.894687 -0.319074
C  -4.125229 -2.875242 -0.479182
C  -4.885482 -2.734643 0.827354
C  0.319311 0.755388 -0.580341
C  -3.715336 1.87967 -0.041825
C  0.864773 1.136604 0.639946
C  1.111365 0.116443 -1.519094
C  -3.968479 1.367791 1.35402
C  2.198217 0.892769 0.925008
C  2.444251 -0.142887 -1.243899
C  2.975673 0.247433 -0.024195
H  -2.313131 -3.67736 0.378131
H  -2.108128 -3.083707 -1.261745
H  -4.420561 -2.088409 -1.177331
H  -4.395274 -3.819566 -0.960281
H  -4.613237 -3.524565 1.52947
H  -4.687063 -1.776775 1.310289
H  -5.960214 -2.79823 0.657207
H  -2.902067 2.605377 -0.055685
H  -4.604552 2.370517 -0.431909
H  0.696985 -0.172444 -2.475513
H  -4.310732 2.205287 1.963016
H  -4.746262 0.604532 1.368652
H  -3.074428 0.963784 1.825725
H  2.605426 1.201869 1.878027
H  3.046911 -0.643408 -1.988988
elementType: Br Cl S P O C H
totalener: -4428.05342157 hartree
nucrepener: 2259.47627275 hartree
electener: -6687.52969431 hartree
twoeener: 3943.50105458 hartree
cpcmener: -0.02541092 hartree
kineticenergy: 4419.40828556 hartree
xcener: -190.173260750836 hartree
chargesum: 0.0000000
charge: -0.028081 -0.061612 -0.187105 0.837161 -0.348501 -0.347716 -0.630303 -0.081538 -0.103074 -0.257777 0.189227 0.048694 0.014067 -0.169555 -0.268026 -0.049936 -0.079566 -0.073412 0.128720 0.125477 0.065831 0.081945 0.089482 0.069970 0.095778 0.099708 0.114627 0.156182 0.111203 0.101723 0.072346 0.132691 0.151369
qa: -0.0281 -0.0616 -0.1871 0.8372 -0.3485 -0.3477 -0.6303 -0.0815 -0.1031 -0.2578 0.1892 0.0487 0.0141 -0.1696 -0.2680 -0.0499 -0.0796 -0.0734 0.1287 0.1255 0.0658 0.0819 0.0895 0.0700 0.0958 0.0997 0.1146 0.1562 0.1112 0.1017 0.0723 0.1327 0.1514
va: 1.2230 1.2525 2.2767 5.4652 2.1132 2.1122 1.9758 3.8652 3.8851 3.9350 3.7959 3.8252 3.9797 4.0227 3.9283 3.8892 3.8888 3.9922 1.0027 1.0258 1.0222 1.0093 1.0023 1.0074 1.0048 1.0031 0.9893 1.0118 1.0110 0.9979 1.0133 1.0069 0.9924
dispcorr: -0.018408969 hartree
energy: -4428.071830535945
dipole: -81.55717 80.88627 -0.67091 -12.47359 12.35014 -0.12346 -2.37085 3.72573 1.35487
magnitude: 1.51692 au
magnitude: 3.85570 debye
