program: Orca
programVersion: 5.0.2
elementType: Br Cl S P O O O C C C C C C C C C C C H H H H H H H H H H H H H H H
charge: 0
multiplicity: 1
keywords: wb97x-d3
keywords: def2-TZVPP
keywords: def2/J RIJCOSX
keywords: DEFGRID2
keywords: scfconv7
keywords: smallprint printgap noloewdin
keywords: NOSOSCF
formula: C11H15BrClO3PS
InChI: InChI=1/C11H15BrClO3PS/c1-3-7-18-17(14,15-4-2)16-11-6-5-9(12)8-10(11)13/h5-6,8H,3-4,7H2,1-2H3
33 atoms
Br 4.881326 0.0431 0.089029
Cl -0.066787 1.375264 2.11072
S  -1.987485 -1.328838 0.578986
P  -2.092156 -0.025721 -1.027077
O  -0.990227 1.101325 -0.634428
O  -3.416426 0.836609 -1.015503
O  -1.903253 -0.697121 -2.331998
C  -2.593512 -2.864995 -0.221517
C  -4.071606 -2.861974 -0.564321
C  -4.984302 -2.705112 0.638039
C  0.339197 0.811726 -0.490626
C  -3.772962 1.91982 -0.126134
C  0.91489 0.932156 0.768542
C  1.122079 0.45121 -1.574215
C  -4.037809 1.478312 1.290853
C  2.269495 0.707168 0.95098
C  2.476768 0.215729 -1.406111
C  3.038172 0.347126 -0.145271
H  -2.371086 -3.637007 0.5172
H  -1.972766 -3.062691 -1.092989
H  -4.285896 -2.090143 -1.307119
H  -4.276028 -3.81582 -1.058136
H  -4.847453 -1.739138 1.12629
H  -6.030554 -2.775173 0.340374
H  -4.79693 -3.483239 1.379791
H  -2.998266 2.685979 -0.163767
H  -4.674384 2.338094 -0.56925
H  0.682796 0.373228 -2.559328
H  -4.449244 2.326576 1.838707
H  -4.765695 0.668165 1.331501
H  -3.133507 1.162707 1.808885
H  2.701059 0.809826 1.937411
H  3.074667 -0.061939 -2.263004
elementType: Br Cl S P O C H
totalener: -4428.05388648 hartree
nucrepener: 2259.29387133 hartree
electener: -6687.34775781 hartree
twoeener: 3943.52881236 hartree
cpcmener: -0.02514565 hartree
kineticenergy: 4419.42099335 hartree
xcener: -190.175490673155 hartree
chargesum: -0.0000000
charge: -0.027391 -0.062242 -0.191831 0.839780 -0.351791 -0.346351 -0.630285 -0.080078 -0.103645 -0.254628 0.216528 0.055884 -0.004061 -0.178840 -0.270450 -0.046524 -0.080639 -0.076647 0.128712 0.124130 0.063892 0.082044 0.067821 0.094966 0.088528 0.101402 0.111971 0.157031 0.109684 0.100822 0.077381 0.133297 0.151531
qa: -0.0274 -0.0622 -0.1918 0.8398 -0.3518 -0.3464 -0.6303 -0.0801 -0.1036 -0.2546 0.2165 0.0559 -0.0041 -0.1788 -0.2704 -0.0465 -0.0806 -0.0766 0.1287 0.1241 0.0639 0.0820 0.0678 0.0950 0.0885 0.1014 0.1120 0.1570 0.1097 0.1008 0.0774 0.1333 0.1515
va: 1.2242 1.2498 2.2850 5.4627 2.1109 2.1143 1.9785 3.8679 3.8837 3.9368 3.7923 3.8251 3.9921 4.0456 3.9397 3.8803 3.8868 3.9950 1.0024 1.0265 1.0234 1.0092 1.0077 1.0053 1.0025 1.0002 0.9873 1.0099 1.0118 0.9959 1.0063 1.0062 0.9925
dispcorr: -0.018055111 hartree
energy: -4428.071941591592
dipole: -82.96526 82.13716 -0.82811 -11.82609 11.96515 0.13906 -1.59979 2.75878 1.15899
magnitude: 1.43121 au
magnitude: 3.63784 debye
