program: Orca
programVersion: 5.0.2
elementType: Br Cl S P O O O C C C C C C C C C C C H H H H H H H H H H H H H H H
charge: 0
multiplicity: 1
keywords: wb97x-d3
keywords: def2-TZVPP
keywords: def2/J RIJCOSX
keywords: DEFGRID2
keywords: scfconv7
keywords: smallprint printgap noloewdin
keywords: NOSOSCF
formula: C11H15BrClO3PS
InChI: InChI=1/C11H15BrClO3PS/c1-3-7-18-17(14,15-4-2)16-11-6-5-9(12)8-10(11)13/h5-6,8H,3-4,7H2,1-2H3
33 atoms
Br 4.609909 0.8882 1.255547
Cl 0.244171 2.036175 -1.901487
S  -2.724831 -1.666015 0.922895
P  -2.197596 -0.217675 -0.453234
O  -0.737529 -0.5880 -1.054746
O  -1.827684 1.017765 0.46666
O  -3.158291 -0.054777 -1.565705
C  -3.720153 -2.796654 -0.117193
C  -2.90572 -3.605411 -1.107611
C  -3.797892 -4.564476 -1.881129
C  0.456177 -0.243478 -0.483196
C  -2.836214 1.820656 1.1295
C  1.049244 0.968544 -0.818031
C  1.102296 -1.113077 0.376692
C  -3.356209 2.908867 0.225752
C  2.289185 1.312057 -0.305886
C  2.34292 -0.78304 0.899429
C  2.922783 0.428127 0.554718
H  -4.501995 -2.216534 -0.605584
H  -4.206786 -3.450586 0.608737
H  -2.396239 -2.938725 -1.806542
H  -2.129255 -4.15899 -0.576311
H  -4.299218 -5.267813 -1.214535
H  -4.566962 -4.028232 -2.438923
H  -3.215397 -5.144799 -2.596613
H  -3.643745 1.179612 1.489903
H  -2.331983 2.23671 1.999143
H  0.643253 -2.059849 0.629347
H  -3.922039 2.508213 -0.614208
H  -4.022338 3.553287 0.79948
H  -2.544042 3.525155 -0.159324
H  2.739144 2.255974 -0.581537
H  2.837159 -1.475574 1.566574
elementType: Br Cl S P O C H
totalener: -4428.05465003 hartree
nucrepener: 2235.25363602 hartree
electener: -6663.30828606 hartree
twoeener: 3919.74012108 hartree
cpcmener: -0.02667779 hartree
kineticenergy: 4419.42790494 hartree
xcener: -190.172057269243 hartree
chargesum: -0.0000000
charge: -0.029145 -0.063649 -0.176116 0.804212 -0.356168 -0.330846 -0.621750 -0.069226 -0.094056 -0.269172 0.257160 0.040408 -0.013091 -0.173141 -0.244883 -0.048043 -0.087567 -0.072042 0.113791 0.129657 0.065075 0.068068 0.085578 0.085009 0.093600 0.093627 0.110640 0.150583 0.082612 0.100536 0.085647 0.131539 0.151153
qa: -0.0291 -0.0636 -0.1761 0.8042 -0.3562 -0.3308 -0.6217 -0.0692 -0.0941 -0.2692 0.2572 0.0404 -0.0131 -0.1731 -0.2449 -0.0480 -0.0876 -0.0720 0.1138 0.1297 0.0651 0.0681 0.0856 0.0850 0.0936 0.0936 0.1106 0.1506 0.0826 0.1005 0.0856 0.1315 0.1512
va: 1.2224 1.2530 2.3006 5.4835 2.0959 2.1071 1.9809 3.8400 3.8927 3.9572 3.7595 3.8466 4.0090 4.0450 3.9331 3.8916 3.8915 3.9942 1.0257 1.0038 1.0232 1.0139 1.0005 1.0010 1.0035 1.0065 0.9916 1.0054 1.0179 1.0086 1.0077 1.0076 0.9929
dispcorr: -0.016737564 hartree
energy: -4428.071387598367
dipole: -74.64924 74.33613 -0.31310 -25.29317 24.46277 -0.83040 -11.98906 13.78035 1.79128
magnitude: 1.99907 au
magnitude: 5.08124 debye
