program: Gaussian 09
title: 000066302
version: EM64L-G09RevD.01
frameworkgroup: C1[X(C12H11N)]
method: RPBEPBE
basis: SDD
operation: Freq
keyword: #pfreq=noraman
keyword: PBEPBE/SDD
title: #p freq=noraman PBEPBE/SDD
converged: NO YES NO NO
title: Mulliken charges:
elementType: N C C C C C C C C C C C C H H H H H H H H H H H
charge: 0.006025 -0.157902 0.383906 0.320062 -0.326766 -0.388330 -0.388342 -0.812594 -0.171491 -0.222349 -0.222350 -0.372974 -0.239790 0.241682 0.241905 0.241906 0.219236 0.248410 0.248418 0.228951 0.226122 0.226123 0.242213 0.227931
chargesum: 0.00000
title: Mulliken charges with hydrogens summed into heavy atoms:
elementType: N C C C C C C C C C C C C
charge: 0.006025 -0.157902 0.383906 0.320062 -0.085084 -0.146425 -0.146436 -0.096531 0.057459 0.003773 0.003773 -0.130761 -0.011859
polarizability: 1.79850875e+02 -6.00684636e+00 1.03909413e+02 1.15972658e-03 4.28216475e-03 9.85602801e+01
1716.lowfreq: -48.8004 -10.5807 -0.0009 -0.0005 0.0004 7.1548 12.4083 77.9008 83.4307
frequency: -48.5230 77.8819 83.4137 97.3493 179.2085 246.6670 294.3631 316.5559 386.2970 395.2094 449.1463 521.8118 556.2733 567.3593 614.8338 615.3090 702.7732 705.0034 772.0615 786.5958 799.0033 814.2819 853.2660 921.8198 929.3414 975.2602 981.5847 986.6744 988.1727 994.9162 1009.9732 1039.2040 1046.6026 1051.2334 1077.2207 1114.1018 1171.8661 1182.9248 1186.9880 1264.6573 1290.4987 1301.4887 1310.3606 1369.8439 1402.0508 1420.0225 1425.0899 1427.7639 1462.7008 1475.0466 1487.6679 1552.1062 1583.0469 1585.4679 1613.9695 2981.4862 3063.3453 3083.7722 3120.9753 3123.6703 3126.4093 3130.7060 3138.2531 3147.8185 3161.9080 3163.2346
redmass: 3.8286 3.8744 4.2327 1.0746 3.0556 3.7402 5.3974 3.9754 3.1094 2.8185 3.5338 4.1096 3.2399 3.9895 7.6313 6.1631 4.2855 1.8526 2.0038 5.5315 1.2194 5.7038 1.2455 1.4264 1.3506 1.3878 1.3734 1.5516 5.8182 1.3367 5.2174 2.2670 1.5528 2.5195 1.6031 1.6429 1.0525 1.6474 1.1162 1.9146 4.2831 3.7801 1.3606 7.1132 1.2211 1.8981 2.6463 2.1933 1.0471 1.1326 2.6920 5.7157 5.8656 6.0492 6.2649 1.0365 1.0970 1.1002 1.0844 1.0869 1.0877 1.0923 1.0924 1.0968 1.1000 1.1017
irintensity: 0.3389 1.4745 1.7952 1.0428 0.3839 0.3984 0.6118 4.6745 2.2211 0.0173 0.5155 4.0555 3.0429 6.0642 8.5784 0.0145 5.9842 51.3676 46.1592 0.4825 52.6777 1.2363 0.0006 2.9855 0.2168 0.0098 0.0357 10.0847 0.6609 0.3136 18.5862 0.1744 6.9371 2.2444 9.4587 9.4850 0.0177 0.3825 0.7613 2.7554 3.7762 0.6347 0.4244 0.0387 14.3719 16.3659 51.5099 6.4630 18.2927 30.4328 1.0883 14.2807 13.6478 1.0465 0.4811 21.2464 11.5071 29.1394 2.1013 3.7527 0.0776 26.4679 17.1205 40.2063 46.6460 15.0904
temp: 298.150 k
press: 1.00000 atm
elementType: 7 6 6 6 6 6 6 6 6 6 6 6 6 1 1 1 1 1 1 1 1 1 1 1
symmnumber: 1
zpe: 506653.8 jmol-1
zpe.correction: 0.192974 hartree
zpe.thermalcorrener: 0.203030 hartree
zpe.thermalcorrenthalpy: 0.203974 hartree
zpe.thermalcorrgfe: 0.156968 hartree
zpe.sumelectzpe: -517.719852 hartree
zpe.sumelectthermal: -517.709797 hartree
zpe.sumelectthermalent: -517.708853 hartree
zpe.sumelectthermalfe: -517.755858 hartree
dipole: 0.8545 2.4419 -0.0004
dipole: 2.5871
quadrupole: -61.9667 -78.9623 -72.7786
quadrupole: 0.5054 -0.0001 0.0020
quadrupole: 9.2692 -7.7265 -1.5427 0.5054 -0.0001 0.0020
hfenergy: -517.9128266 hartree
pointgroup: C01 [X(C12H11N1)]
dipole: 0.3404928 0.9591846 0.0000444 debye
dipolederiv: -0.498536 0.0044471 0.0000043 0.0752793 -0.3137767 -0.0000106 -0.0000021 -0.0000098 -0.2033125 0.8415344 -0.0438719 -0.0000148 0.174012 0.027321 -0.0000015 0.0000104 0.0000093 -0.0411771 0.1376087 0.0399004 -0.000002 -0.0475377 -0.0410783 0.0000009 -0.0000019 -0.0000038 -0.0142383 -0.2948622 -0.1555729 0.0000012 -0.262224 0.228013 0.0000004 -0.0000012 -0.0000267 0.0186245 0.0998269 0.134837 0.0000017 -0.0071075 0.0649883 0.0000219 -0.0000188 0.0000251 -0.1472719 -0.1513171 -0.0158456 -0.0721705 -0.0257364 -0.1279033 0.0189571 0.0054582 0.0077456 0.0583752 -0.151312 -0.0158433 0.072175 -0.0257627 -0.1279103 -0.0189313 -0.0054557 -0.0077334 0.0583726 -0.0122602 0.1652951 0.0000278 0.1022012 -0.0879488 0.0000016 -0.0000151 0.0000436 0.0254838 0.0433965 -0.0722896 -0.0000042 0.114515 -0.2061265 -0.0000099 0.0000161 -0.0000108 -0.1148917 -0.0160452 -0.0052922 0.0802384 -0.0036463 -0.1477571 -0.0004505 0.0571109 -0.0042672 0.0811674 -0.0160545 -0.0052953 -0.0802296 -0.0036409 -0.1477595 0.0004645 -0.0571127 0.0042858 0.0811659 0.068569 0.0076632 -0.0000056 -0.1954444 0.3151806 0.0000478 -0.0000127 0.0000446 -0.0889936 0.0936841 -0.0155034 -0.0000027 -0.0089677 -0.1675429 0.0000046 0.0000038 0.0000048 -0.0687683 0.0161479 -0.0769216 -0.0000033 -0.112927 -0.0582515 -0.0000178 -0.0000076 -0.0000201 0.14177 0.0530694 0.0069843 0.0963708 0.0103251 0.1375478 -0.0031845 0.0909213 0.00008 -0.0402796 0.0530609 0.0069747 -0.0963761 0.0103217 0.1375481 0.0031636 -0.0909282 -0.0000926 -0.040279 -0.066304 -0.1786662 -0.0000465 -0.0737349 -0.0598889 -0.0000363 -0.000021 -0.0000483 0.1122428 0.0414155 0.0448111 -0.0997512 0.0571643 0.0501407 -0.0197497 -0.1161531 0.0413735 -0.0247535 0.0413497 0.0447901 0.099771 0.0571358 0.0501788 0.0197827 0.1161921 -0.0413453 -0.024701 -0.1405046 0.0384655 0.0000072 0.017327 0.088408 -0.0000071 0.0000005 -0.0000094 0.1609164 0.0014113 0.0014249 -0.0889425 0.0076912 0.1545309 0.0040675 -0.1085631 0.0011825 -0.0750279 0.0014182 0.0014311 0.088939 0.0077015 0.1545313 -0.0040858 0.1085596 -0.0012002 -0.0750325 0.0040815 0.079365 0.0000097 0.1213398 -0.0834208 -0.0000245 0.0000178 -0.0000244 0.1334602 -0.1493782 0.0087122 0.0000029 0.0117154 0.160976 -0.000003 0.0000026 -0.0000028 0.0871479 unknown
polarizability: 179.7951976|-6.3488076|103.9650885|-0.0014549|0.005574|98.5602823 unknown
InChI: InChI=1S/C12H11N/c1-10-6-5-9-13-12(10)11-7-3-2-4-8-11/h2-9H,1H3
charge 0 multiplicity 1
24 atoms
N  1.281982 -1.455183 -0.000195
C  0.716149 -0.206327 -0.00006
C  -0.787543 -0.155176 -0.000033
C  1.489156 0.99683 0.000032
C  2.900043 0.862695 -0.000003
C  -1.506455 -0.129811 -1.221582
C  -1.506421 -0.129708 1.221532
C  0.830456 2.362937 0.000131
C  3.491913 -0.419311 -0.000136
C  -2.919038 -0.081761 -1.222256
C  -2.919006 -0.081662 1.222239
C  2.642998 -1.547511 -0.000231
C  -3.629693 -0.055034 0.0000
H  3.527431 1.761848 0.000072
H  -0.958891 -0.163726 -2.170586
H  -0.958834 -0.163542 2.170526
H  1.586115 3.167727 0.000366
H  0.18233 2.49764 -0.885117
H  0.182036 2.497388 0.885197
H  4.579741 -0.543287 -0.000159
H  -3.462726 -0.069813 -2.173773
H  -3.462668 -0.069641 2.173768
H  3.051935 -2.564655 -0.000346
H  -4.725011 -0.019618 0.000013
