program: Orca
programVersion: 5.0.2
elementType: Br Cl S P O O O C C C C C C C C C C C H H H H H H H H H H H H H H H
charge: 0
multiplicity: 1
keywords: wb97x-d3
keywords: def2-TZVPP
keywords: def2/J RIJCOSX
keywords: DEFGRID2
keywords: scfconv7
keywords: smallprint printgap noloewdin
keywords: NOSOSCF
formula: C11H15BrClO3PS
InChI: InChI=1/C11H15BrClO3PS/c1-3-7-18-17(14,15-4-2)16-11-6-5-9(12)8-10(11)13/h5-6,8H,3-4,7H2,1-2H3
33 atoms
Br 4.409945 -0.97001 0.006636
Cl -0.178773 0.9686 2.349016
S  -3.033708 -0.484825 0.48971
P  -2.311322 0.743175 -1.0162
O  -1.031636 1.557601 -0.401741
O  -3.330045 1.937032 -1.167446
O  -2.001408 0.040666 -2.277443
C  -2.54983 -2.142236 -0.126363
C  -1.093168 -2.484982 0.120458
C  -0.796635 -3.926245 -0.266857
C  0.199486 0.975092 -0.323799
C  -4.22178 2.479477 -0.171994
C  0.725032 0.64512 0.920537
C  0.949828 0.740355 -1.46558
C  -3.507347 3.158979 0.96942
C  1.981922 0.069737 1.027355
C  2.205714 0.164979 -1.375062
C  2.707149 -0.174369 -0.127744
H  -2.822453 -2.221416 -1.177841
H  -3.206694 -2.814404 0.429636
H  -0.451303 -1.815058 -0.455566
H  -0.854099 -2.324214 1.173865
H  -0.991248 -4.10449 -1.32567
H  0.250129 -4.168032 -0.07952
H  -1.404686 -4.628465 0.306456
H  -4.834485 3.193521 -0.719497
H  -4.881986 1.686538 0.186145
H  0.558255 1.020944 -2.43376
H  -4.25379 3.638559 1.603968
H  -2.949147 2.463387 1.597204
H  -2.826325 3.932353 0.614182
H  2.372262 -0.183008 2.003965
H  2.773821 -0.011175 -2.278233
elementType: Br Cl S P O C H
totalener: -4428.06427157 hartree
nucrepener: 2296.86715167 hartree
electener: -6724.93142324 hartree
twoeener: 3980.97160800 hartree
cpcmener: -0.02032388 hartree
kineticenergy: 4419.41457423 hartree
xcener: -190.171337465092 hartree
chargesum: -0.0000000
charge: -0.029201 -0.063507 -0.194666 0.814927 -0.341727 -0.342932 -0.598887 -0.066316 -0.070406 -0.268376 0.217512 0.012074 0.006041 -0.153057 -0.222795 -0.073271 -0.088219 -0.059533 0.114793 0.127614 0.043574 0.065988 0.086639 0.092160 0.086384 0.113852 0.103197 0.146313 0.102713 0.068312 0.093882 0.128314 0.148604
qa: -0.0292 -0.0635 -0.1947 0.8149 -0.3417 -0.3429 -0.5989 -0.0663 -0.0704 -0.2684 0.2175 0.0121 0.0060 -0.1531 -0.2228 -0.0733 -0.0882 -0.0595 0.1148 0.1276 0.0436 0.0660 0.0866 0.0922 0.0864 0.1139 0.1032 0.1463 0.1027 0.0683 0.0939 0.1283 0.1486
va: 1.2225 1.2431 2.2807 5.4941 2.0868 2.1445 2.0148 3.8661 3.8923 3.9647 3.7931 3.8610 3.9745 3.9971 3.9008 3.9064 3.8838 3.9886 1.0268 1.0029 1.0239 1.0141 1.0003 1.0035 1.0012 0.9888 0.9986 1.0116 1.0114 1.0112 1.0057 1.0104 0.9940
dispcorr: -0.019161866 hartree
energy: -4428.083433430807
dipole: -60.78943 60.05101 -0.73842 1.10670 -1.15797 -0.05126 -2.87107 3.96345 1.09237
magnitude: 1.31954 au
magnitude: 3.35399 debye
