program: Gaussian 09
title: 000066327
version: EM64L-G09RevD.01
frameworkgroup: C1[X(C14H15N)]
method: RPBEPBE
basis: SDD
operation: Freq
keyword: #pfreq=noraman
keyword: PBEPBE/SDD
title: #p freq=noraman PBEPBE/SDD
converged: YES YES NO NO
title: Mulliken charges:
elementType: N C C C C C C C C C C C C C C H H H H H H H H H H H H H H H
charge: -0.026230 -0.392216 -0.404702 -0.395311 -0.573065 -0.556951 0.353337 0.088391 0.329459 -0.389129 -0.389277 -0.307597 -0.226733 -0.241196 -0.241117 0.190712 0.215302 0.210756 0.211975 0.213505 0.212498 0.207338 0.256916 0.253950 0.211026 0.248182 0.249697 0.229698 0.228919 0.231864
chargesum: 0.00000
title: Mulliken charges with hydrogens summed into heavy atoms:
elementType: N C C C C C C C C C C C C C C
charge: -0.026230 0.013798 0.018029 0.030691 -0.108811 -0.091975 0.353337 0.088391 0.329459 -0.140947 -0.139580 -0.307597 0.002966 -0.012276 -0.009253
polarizability: 2.04173061e+02 -2.45065765e+00 1.54354233e+02 1.15223773e+01 1.42067493e+01 1.07856784e+02
1716.lowfreq: -9.9644 -0.0004 0.0005 0.0009 6.4640 16.6135 41.5573 67.0728 73.6379
frequency: 41.4814 67.0706 73.5955 87.8011 130.4990 164.5558 194.1027 243.9420 288.5870 329.8181 363.1348 405.0304 407.2924 423.4605 444.4442 460.1815 520.6680 538.1781 607.5093 621.0592 666.3086 701.3685 705.8604 770.7693 784.3181 814.1312 853.0161 857.0008 877.0193 899.9175 922.1212 929.0214 978.7201 980.0767 989.2148 997.2074 1015.8806 1036.2540 1048.9614 1082.7437 1089.3005 1097.1253 1115.8275 1131.2209 1174.1962 1193.3703 1220.3517 1236.3152 1253.4610 1264.4399 1291.2901 1308.6256 1313.8165 1323.9833 1339.7418 1348.3342 1356.3928 1374.9439 1434.8916 1457.8255 1463.0005 1465.5444 1471.5933 1477.4908 1482.4422 1582.7970 1606.6333 1610.3429 2152.1941 2952.9002 2959.1129 2969.8677 2982.0123 2984.2001 3033.4974 3042.3804 3050.7252 3059.3212 3072.8724 3125.5836 3130.9418 3142.8874 3151.7245 3166.8060
redmass: 3.8832 4.1732 3.3192 4.1643 6.9363 4.4630 2.5125 3.2009 2.9369 2.4066 4.0271 2.9554 3.0112 3.5979 4.8879 2.0714 3.9463 3.5826 4.8256 4.9237 6.3005 3.3928 1.7875 1.9688 1.4663 3.4796 1.4040 1.3122 2.9243 2.6163 1.3745 1.4380 2.2652 1.6372 5.6394 1.3362 3.3258 2.0121 2.2404 1.3760 1.2866 1.6414 2.1629 1.7020 1.0524 1.1162 1.9120 1.5791 1.3542 1.3655 2.0808 1.3661 1.3696 1.3712 1.4802 1.5347 1.4594 7.5064 2.2574 1.0938 1.0951 1.0882 1.0850 1.1141 2.2060 5.9309 7.7690 6.2601 12.6474 1.0672 1.0676 1.0629 1.0619 1.0610 1.0964 1.1019 1.1019 1.0953 1.0931 1.0846 1.0877 1.0923 1.0966 1.1017
irintensity: 0.6286 0.6526 0.4363 0.7354 3.5570 0.0998 0.3637 1.1369 0.5100 0.4717 0.2106 0.7968 0.0138 1.1898 1.4504 1.9659 6.2704 0.8848 1.4257 1.3616 5.8354 2.9287 54.2603 47.3796 2.1102 0.6248 9.5203 3.3404 3.2250 2.9461 4.3353 2.6290 9.5276 7.4600 1.3669 0.1520 6.3944 1.2569 4.4212 4.1026 2.8733 0.1506 0.3073 1.4954 0.0106 0.7446 0.4171 5.1750 3.1362 7.2351 4.9995 1.7773 9.3004 2.1627 1.3569 1.0563 1.0409 0.3553 10.3801 8.5468 10.6952 8.4644 18.6470 4.4724 11.3144 2.2235 32.7251 11.8192 34.5656 8.8159 28.4732 40.1860 30.1498 35.2412 65.1914 36.5133 63.2688 21.5953 20.3400 2.7102 0.3551 14.9410 32.9096 21.2366
temp: 298.150 k
press: 1.00000 atm
elementType: 7 6 6 6 6 6 6 6 6 6 6 6 6 6 6 1 1 1 1 1 1 1 1 1 1 1 1 1 1 1
symmnumber: 1
zpe: 656658.0 jmol-1
zpe.correction: 0.250108 hartree
zpe.thermalcorrener: 0.263324 hartree
zpe.thermalcorrenthalpy: 0.264268 hartree
zpe.thermalcorrgfe: 0.209734 hartree
zpe.sumelectzpe: -596.144390 hartree
zpe.sumelectthermal: -596.131175 hartree
zpe.sumelectthermalent: -596.130230 hartree
zpe.sumelectthermalfe: -596.184764 hartree
dipole: -1.0610 -4.7448 0.0750
dipole: 4.8625
quadrupole: -76.6074 -103.8424 -86.5247
quadrupole: -1.8035 2.8830 4.6621
quadrupole: 12.3841 -14.8509 2.4668 -1.8035 2.8830 4.6621
hfenergy: -596.3944983 hartree
pointgroup: C01 [X(C14H15N1)]
dipole: 0.296139 1.7558595 -0.6993552 debye
polarizability: 203.588451|-4.7392174|137.1274326|-12.4818926|-26.6923052|125.668194 unknown
InChI: InChI=1S/C14H15N/c15-11-14(12-7-3-1-4-8-12)13-9-5-2-6-10-13/h1,3-4,7-8H,2,5-6,9-10H2
charge 0 multiplicity 1
30 atoms
N  0.289758 -3.118563 1.210474
C  3.730388 1.523023 -0.146092
C  2.338591 2.18687 -0.06862
C  3.675356 0.073134 0.3848
C  1.25553 1.361659 -0.828034
C  2.596251 -0.75835 -0.366335
C  1.236906 -0.078165 -0.345619
C  0.104377 -0.712484 0.131932
C  -1.289743 -0.156797 0.121898
C  -2.115822 -0.276445 1.271949
C  -1.83256 0.450201 -1.043605
C  0.224672 -2.030562 0.712661
C  -3.434261 0.227012 1.269143
C  -3.152096 0.951409 -1.047077
C  -3.957146 0.848233 0.111094
H  4.077934 1.516257 -1.200144
H  4.467407 2.114256 0.430352
H  2.370482 3.209194 -0.491265
H  2.035789 2.284134 0.992973
H  3.43789 0.082499 1.466974
H  4.658566 -0.421792 0.273238
H  1.5030 1.38132 -1.911067
H  0.272171 1.844342 -0.70703
H  2.53999 -1.779485 0.048426
H  2.915125 -0.854768 -1.426812
H  -1.721146 -0.766106 2.169685
H  -1.231577 0.49566 -1.95845
H  -4.05377 0.13043 2.167573
H  -3.555976 1.408768 -1.957189
H  -4.982385 1.234415 0.106868
