program: Gaussian 09
title: 000066301
version: EM64L-G09RevD.01
frameworkgroup: C1[X(C8H11NO2)]
method: RPBEPBE
basis: SDD
operation: Freq
keyword: #p
keyword: freq=noraman
keyword: PBEPBE/SDD
title: #p freq=noraman PBEPBE/SDD
converged: NO NO NO NO
title: Mulliken charges:
elementType: O O N C C C C C C C C H H H H H H H H H H H
charge: -0.280467 -0.278425 -0.713901 0.417325 0.391385 0.585249 -0.548682 -0.598909 -0.598133 -0.535636 -0.537114 0.260536 0.239827 0.229955 0.302238 0.307037 0.220710 0.220707 0.239373 0.217657 0.217664 0.241604
chargesum: 0.00000
title: Mulliken charges with hydrogens summed into heavy atoms:
elementType: O O N C C C C C C C C
charge: -0.280467 -0.278425 -0.104626 0.417325 0.391385 0.585249 -0.288146 -0.359083 -0.368178 0.145154 0.139811
polarizability: 1.34715337e+02 -4.04428171e+00 1.24007388e+02 -5.08249934e-03 -5.06119100e-03 5.32193627e+01
1716.lowfreq: -8.6891 -5.1060 0.0006 0.0006 0.0008 5.8643 79.3161 90.2363 175.1890
frequency: 79.2569 90.1919 175.1886 189.6593 202.9578 226.1494 230.3648 264.5261 270.3323 324.5038 343.6925 365.6975 402.5977 474.1631 516.5976 539.2190 603.1574 605.3004 611.0592 681.8866 791.3944 807.7719 852.0614 882.7593 949.6146 976.8355 1018.5783 1036.3128 1073.3447 1113.5704 1114.3703 1140.3919 1155.8426 1168.3315 1182.4480 1272.2356 1354.0058 1409.2225 1431.0198 1447.0681 1464.3407 1465.3246 1469.9643 1473.1432 1481.9893 1490.4458 1602.4686 1630.4986 1640.7973 2949.7188 2954.4619 3033.3999 3039.1796 3115.7131 3116.7265 3151.5443 3156.7558 3186.2781 3573.0166 3714.9711
redmass: 3.1003 3.3020 3.4209 2.1790 1.6381 2.9012 3.1238 1.6846 1.6938 1.2067 3.3243 1.0575 4.3784 4.8074 5.5507 5.2815 3.7272 3.4542 3.8803 1.4520 1.6006 1.5688 2.6586 6.4059 6.2905 6.2824 1.9794 2.9920 1.6182 1.2600 1.2606 1.6940 1.3738 1.7718 2.0245 1.2888 3.6340 7.5046 1.2191 1.2964 1.0501 1.0500 1.3767 1.4772 1.6184 2.1760 6.4123 3.7775 1.3458 1.0334 1.0330 1.1034 1.1034 1.0987 1.0993 1.0906 1.0921 1.0914 1.0448 1.1041
irintensity: 16.4643 0.6168 3.8779 0.3004 1.4197 3.5514 2.2612 0.5082 1.4502 252.7504 3.6842 46.3386 6.3909 1.0311 9.2758 1.1071 0.0226 0.0182 2.8210 36.3890 0.1785 4.5871 124.2953 12.0859 0.5846 2.4869 38.3895 39.5496 53.6804 0.1117 0.5021 129.4724 4.1408 131.0050 146.4968 1.7408 5.1103 7.6701 19.5997 0.9444 10.8386 13.1282 62.1940 78.0321 25.9731 16.1675 293.7389 205.9153 325.9091 68.0900 64.0229 52.8248 54.0733 28.1940 27.9835 11.5957 6.3473 1.0060 58.5292 19.0738
temp: 298.150 k
press: 1.00000 atm
elementType: 8 8 7 6 6 6 6 6 6 6 6 1 1 1 1 1 1 1 1 1 1 1
symmnumber: 1
zpe: 467048.5 jmol-1
zpe.correction: 0.177889 hartree
zpe.thermalcorrener: 0.189264 hartree
zpe.thermalcorrenthalpy: 0.190208 hartree
zpe.thermalcorrgfe: 0.141388 hartree
zpe.sumelectzpe: -515.788744 hartree
zpe.sumelectthermal: -515.777370 hartree
zpe.sumelectthermalent: -515.776426 hartree
zpe.sumelectthermalfe: -515.825246 hartree
dipole: -2.0648 1.0499 -0.0008
dipole: 2.3164
quadrupole: -50.9373 -53.2691 -70.3282
quadrupole: -7.1453 0.0010 -0.0065
quadrupole: 7.2409 4.9090 -12.1500 -7.1453 0.0010 -0.0065
hfenergy: -515.9666338 hartree
pointgroup: C01 [X(C8H11N1O2)]
dipole: -0.8078263 -0.4218504 0.000305 debye
dipolederiv: -1.4977101 -0.544794 -0.000025 -0.4140061 -0.5651978 -0.0000038 -0.0000805 -0.0000211 -0.3073867 -1.2116349 0.549781 -0.0001287 0.6913668 -0.8063889 0.0001146 -0.0001091 0.000041 -0.3075005 -0.2972121 -0.4300545 -0.0000321 -0.4259631 -1.3780677 -0.0001808 -0.0001643 -0.0005537 -0.7535895 1.5094554 0.3948455 0.0000594 0.0539613 0.6868269 0.000001 0.0001237 0.0000236 0.1406927 1.0845058 -0.3545104 0.0000883 -0.5622188 1.0327461 -0.000127 0.0000756 -0.00006 0.1524158 0.6025903 0.4592102 0.0000421 0.3719644 1.5202622 0.0000261 0.0000328 -0.0000018 0.1749585 -0.8334071 0.140586 -0.0000493 0.2006368 -0.3357796 0.0000018 -0.0000801 -0.0000007 -0.3131225 -0.5202547 -0.5031447 0.0000103 -0.2384461 -0.4889416 0.0000078 0.0000108 0.0000244 -0.3154606 -0.1992499 0.1191378 -0.0000052 0.0502377 -0.7743999 0.0000338 0.0000063 0.0000389 -0.3413953 0.440225 0.1615002 -0.0000114 0.486769 0.5748034 0.0000083 -0.0000423 -0.0000101 0.3282453 0.8083255 -0.2483246 0.0000595 0.0667477 0.1929438 0.000011 0.0000545 -0.0000332 0.3342915 0.0917294 -0.0499478 -0.0000037 -0.059884 -0.0344984 0.0000138 -0.0000109 0.0000245 0.1955285 0.0241723 0.0799718 -0.000018 0.0890126 -0.032952 0.0000161 -0.000008 0.0000078 0.1960627 -0.1106687 -0.0401961 -0.0000027 -0.06155 0.0681955 0.0000044 -0.000002 0.0000093 0.1913506 0.1233223 0.0427414 0.0000529 0.0305709 0.1898013 0.0000411 0.0001647 0.0002197 0.3831127 0.1118195 0.0098057 -0.0000424 0.0250736 0.204342 0.0000753 -0.0000266 0.0002722 0.384883 0.0781498 0.0570956 -0.0894403 -0.0974542 -0.0682812 0.087445 -0.0256745 0.1089383 -0.0944667 0.0781421 0.0571234 0.0894298 -0.0974451 -0.0683426 -0.0874747 0.025709 -0.1089497 -0.0944128 -0.1820423 -0.0368457 -0.0000033 0.0156722 0.0790574 0.0000036 -0.0000077 0.0000007 0.1202729 -0.0530335 0.0233222 0.0320799 -0.1335937 0.0523268 0.1235366 0.0837702 0.0763966 -0.0975843 -0.0529568 0.0233374 -0.0320327 -0.1335679 0.05228 -0.1236113 -0.0837081 -0.0764169 -0.0975615 0.0057327 0.0893595 -0.0000274 0.1421161 -0.1007359 0.0000575 -0.0000337 0.0000502 0.120666 unknown
polarizability: 134.6262663|4.1595722|124.0964583|0.0051371|-0.0050057|53.2193627 unknown
InChI: InChI=1S/C8H11NO2/c1-10-7-3-6(9)4-8(5-7)11-2/h3-5H,9H2,1-2H3
charge 0 multiplicity 1
22 atoms
O  2.741513 0.095949 0.000158
O  -1.791043 1.837151 -0.000281
N  -0.935376 -3.013101 0.00003
C  1.346419 -0.067171 0.00005
C  -0.951746 0.70898 -0.000172
C  -0.481629 -1.690731 0.000026
C  0.433254 1.009705 -0.000069
C  0.907255 -1.411543 0.000081
C  -1.426442 -0.619376 -0.000088
C  3.261961 1.460698 -0.000032
C  -3.23277 1.60803 -0.000552
H  0.742876 2.056691 -0.000117
H  1.652096 -2.21334 0.000143
H  -2.497815 -0.842625 -0.000107
H  -1.928171 -3.223933 0.000368
H  -0.276279 -3.785135 0.000459
H  2.941633 2.016828 -0.903404
H  2.941616 2.017087 0.903178
H  4.357353 1.354289 -0.000003
H  -3.556205 1.053946 0.903507
H  -3.555815 1.053679 -0.904586
H  -3.687685 2.610122 -0.000789
