program: Orca
programVersion: 5.0.2
elementType: Br Cl S P O O O C C C C C C C C C C C H H H H H H H H H H H H H H H
charge: 0
multiplicity: 1
keywords: wb97x-d3
keywords: def2-TZVPP
keywords: def2/J RIJCOSX
keywords: DEFGRID2
keywords: scfconv7
keywords: smallprint printgap noloewdin
keywords: NOSOSCF
formula: C11H15BrClO3PS
InChI: InChI=1/C11H15BrClO3PS/c1-3-7-18-17(14,15-4-2)16-11-6-5-9(12)8-10(11)13/h5-6,8H,3-4,7H2,1-2H3
33 atoms
Br 4.933187 1.388825 -0.131757
Cl 0.899981 -2.355039 -0.35239
S  -2.562673 -1.174531 -1.365245
P  -2.016655 0.311601 -0.051773
O  -0.771971 -0.248377 0.833972
O  -3.060597 0.348105 1.143407
O  -1.744021 1.554165 -0.801755
C  -2.835458 -2.624886 -0.269034
C  -4.272449 -2.790988 0.18839
C  -5.265502 -2.971326 -0.945998
C  0.512968 0.142846 0.589924
C  -4.380641 0.91013 0.963378
C  1.416897 -0.762163 0.047132
C  0.9398 1.417293 0.926045
C  -4.418401 2.342177 1.433147
C  2.738773 -0.400422 -0.163095
C  2.256017 1.793967 0.72167
C  3.143944 0.881564 0.172102
H  -2.147932 -2.569593 0.573732
H  -2.521819 -3.476834 -0.874449
H  -4.292081 -3.673351 0.835097
H  -4.566161 -1.949914 0.818239
H  -6.269382 -3.147469 -0.558258
H  -5.315702 -2.0887 -1.585592
H  -5.00031 -3.823434 -1.575216
H  -4.69601 0.823822 -0.079584
H  -5.046344 0.285796 1.557695
H  0.243832 2.117925 1.368586
H  -5.440543 2.715449 1.356777
H  -4.111106 2.426617 2.476142
H  -3.780108 2.985197 0.827173
H  3.426623 -1.118838 -0.588102
H  2.567846 2.793448 0.992372
elementType: Br Cl S P O C H
totalener: -4428.06691086 hartree
nucrepener: 2222.18408463 hartree
electener: -6650.25099549 hartree
twoeener: 3906.42397300 hartree
cpcmener: -0.02283099 hartree
kineticenergy: 4419.41729047 hartree
xcener: -190.169233669053 hartree
chargesum: 0.0000000
charge: -0.029322 -0.062935 -0.156824 0.806411 -0.356704 -0.337392 -0.605042 -0.099238 -0.122022 -0.252802 0.266752 0.046041 -0.018010 -0.183915 -0.247237 -0.060335 -0.080233 -0.069673 0.113942 0.128758 0.085028 0.075393 0.092542 0.074213 0.087262 0.099654 0.106151 0.154379 0.095198 0.089228 0.083337 0.129006 0.148390
qa: -0.0293 -0.0629 -0.1568 0.8064 -0.3567 -0.3374 -0.6050 -0.0992 -0.1220 -0.2528 0.2668 0.0460 -0.0180 -0.1839 -0.2472 -0.0603 -0.0802 -0.0697 0.1139 0.1288 0.0850 0.0754 0.0925 0.0742 0.0873 0.0997 0.1062 0.1544 0.0952 0.0892 0.0833 0.1290 0.1484
va: 1.2224 1.2476 2.3059 5.5072 2.1013 2.0917 2.0102 3.8498 3.9409 3.9202 3.7443 3.8335 4.0489 4.0382 3.9775 3.9025 3.8691 3.9932 1.0311 1.0038 1.0090 1.0075 1.0056 1.0137 1.0006 0.9978 0.9866 1.0010 1.0064 1.0034 1.0167 1.0083 0.9931
dispcorr: -0.017377711 hartree
energy: -4428.084288572436
dipole: -89.42249 87.71440 -1.70808 -17.13277 16.12247 -1.01030 7.00129 -5.73699 1.26430
magnitude: 2.35302 au
magnitude: 5.98090 debye
