program: Gaussian 09
title: 000066300
version: EM64L-G09RevD.01
frameworkgroup: C1[X(C13H11NO2)]
method: RPBEPBE
basis: SDD
operation: Freq
keyword: #p
keyword: freq=noraman
keyword: PBEPBE/SDD
title: #p freq=noraman PBEPBE/SDD
converged: YES YES NO NO
title: Mulliken charges:
elementType: O O N C C C C C C C C C C C C C H H H H H H H H H H H
charge: -0.317792 -0.316359 -0.681641 0.076206 0.330886 -0.308421 -0.395749 0.202386 0.388250 -0.264173 -0.195433 -0.405137 -0.321744 -0.195817 -0.209840 -0.249524 0.263186 0.219395 0.230228 0.226154 0.251340 0.306541 0.229511 0.227396 0.229378 0.377650 0.303124
chargesum: 0.00000
title: Mulliken charges with hydrogens summed into heavy atoms:
elementType: O O N C C C C C C C C C C C C C
charge: -0.317792 -0.316359 -0.000866 0.076206 0.330886 -0.045235 -0.176354 0.202386 0.388250 -0.033945 0.030721 -0.153797 -0.015203 0.033694 0.017555 -0.020146
polarizability: 2.61085646e+02 -1.61636801e+00 1.72074942e+02 8.79189004e-03 -6.37771544e-02 5.96306784e+01
1716.lowfreq: -10.6115 -3.2129 -0.0005 0.0004 0.0004 1.5967 7.9789 40.6557 88.1954
frequency: 6.9148 40.6420 88.1944 89.9237 139.8746 215.2732 223.4872 256.6007 260.6724 367.0786 408.7663 424.3669 425.9278 441.7931 472.6583 501.0700 523.0157 555.0742 569.9160 608.8970 663.1764 667.6603 692.9355 723.1342 758.2682 760.2484 764.0656 776.1687 786.2270 842.0065 855.1650 855.2662 921.3943 962.7629 975.8560 984.3695 985.8036 993.9412 1010.7391 1021.0594 1031.2845 1057.2002 1079.7027 1152.3235 1155.8876 1169.6474 1175.8359 1194.0376 1253.8717 1284.6738 1307.9773 1332.0179 1382.8428 1403.9684 1439.8453 1446.8852 1467.8850 1486.0054 1540.8736 1577.1821 1591.1797 1606.9828 1621.9264 1635.7384 3121.0826 3131.1238 3141.9227 3142.1325 3158.7245 3160.5094 3171.9799 3184.5360 3217.2391 3419.6908 3649.9356
redmass: 3.9920 5.6765 7.3584 5.1840 5.3563 6.1328 4.5032 4.9753 4.7309 9.1630 2.9429 2.8609 5.5450 3.8532 1.2257 3.0747 3.0853 6.9140 6.9951 6.4924 6.7830 4.8215 2.2552 1.2454 1.8147 8.6313 1.5300 1.8197 6.3835 1.2541 5.7786 1.5376 1.4037 1.3637 1.3580 1.3287 6.2698 1.3013 5.3265 2.0929 2.2458 1.7294 1.5030 1.6018 1.5931 1.0596 1.0587 1.5785 4.4787 1.8081 1.3541 1.9297 9.1745 6.1734 2.4598 2.7698 2.2360 2.5416 3.5220 6.9961 6.6417 5.6639 1.6079 6.7591 1.0865 1.0853 1.0902 1.0922 1.0948 1.0939 1.0999 1.0969 1.0941 1.0546 1.0957
irintensity: 0.0297 2.2624 0.0964 0.7208 0.0518 0.8707 2.5301 1.3594 4.8225 9.3266 0.2937 18.6338 2.9568 3.2863 118.5776 8.4872 22.1096 1.6206 18.1268 1.3915 13.5493 9.6102 28.6371 106.3905 98.1382 2.6858 128.8012 0.0028 5.0188 0.0429 5.4291 1.8720 12.1420 2.2683 0.1204 0.0299 15.7971 2.2159 86.2266 7.1789 182.2448 48.8865 16.2383 118.4473 195.7332 4.1358 44.6453 197.9877 597.4978 1.9779 11.8890 10.9912 18.5775 11.3609 13.6732 1.3258 172.8995 24.8199 205.4327 133.1564 26.5977 34.2915 96.3687 192.1707 7.8420 0.6596 16.0645 24.4069 32.8621 17.3724 14.0199 10.9092 5.4660 100.2371 64.6785
temp: 298.150 k
press: 1.00000 atm
elementType: 8 8 7 6 6 6 6 6 6 6 6 6 6 6 6 6 1 1 1 1 1 1 1 1 1 1 1
symmnumber: 1
zpe: 547381.5 jmol-1
zpe.correction: 0.208487 hartree
zpe.thermalcorrener: 0.221681 hartree
zpe.thermalcorrenthalpy: 0.222626 hartree
zpe.thermalcorrgfe: 0.166291 hartree
zpe.sumelectzpe: -706.085115 hartree
zpe.sumelectthermal: -706.071920 hartree
zpe.sumelectthermalent: -706.070976 hartree
zpe.sumelectthermalfe: -706.127311 hartree
dipole: 1.3155 0.1204 0.0119
dipole: 1.3211
quadrupole: -69.7812 -80.3929 -100.0350
quadrupole: 5.7625 0.0252 -0.0147
quadrupole: 13.6218 3.0101 -16.6320 5.7625 0.0252 -0.0147
hfenergy: -706.2936018 hartree
pointgroup: C01 [X(C13H11N1O2)]
dipole: -0.5156482 0.0498356 -0.0420303 debye
polarizability: 260.9970825|-4.1306872|114.109928|-2.0510865|-56.1421216|117.6842555 unknown
InChI: InChI=1S/C13H11NO2/c14-12-9-5-4-8-11(12)13(15)16-10-6-2-1-3-7-10/h1-9H,14H2
charge 0 multiplicity 1
27 atoms
O  0.62028 -0.261259 0.311646
O  -0.044445 1.312178 -1.304005
N  -2.67076 1.695833 -1.63059
C  -1.713804 0.106243 -0.00164
C  -2.840826 0.75013 -0.640982
C  -1.951366 -0.864528 1.016451
C  -4.159537 0.38176 -0.221329
C  -0.347649 0.462452 -0.411796
C  2.033508 -0.154479 0.151418
C  -3.250425 -1.209865 1.412108
C  -4.357426 -0.575584 0.781501
C  2.74804 -1.02205 1.010491
C  2.708853 0.704987 -0.74847
C  4.156978 -1.034655 0.972909
C  4.123182 0.675979 -0.769322
C  4.852935 -0.184025 0.081066
H  -1.084113 -1.336707 1.48458
H  -5.019701 0.864535 -0.700853
H  -3.412472 -1.956781 2.194996
H  -5.379126 -0.836299 1.081088
H  2.189163 -1.670919 1.69164
H  2.147338 1.36822 -1.405584
H  4.708685 -1.707183 1.638669
H  4.653135 1.338063 -1.463231
H  5.947638 -0.192773 0.050804
H  -1.713673 1.938391 -1.909929
H  -3.478813 2.134135 -2.064835
