program: Orca
programVersion: 5.0.2
elementType: Br Cl S P O O O C C C C C C C C C C C H H H H H H H H H H H H H H H
charge: 0
multiplicity: 1
keywords: wb97x-d3
keywords: def2-TZVPP
keywords: def2/J RIJCOSX
keywords: DEFGRID2
keywords: scfconv7
keywords: smallprint printgap noloewdin
keywords: NOSOSCF
formula: C11H15BrClO3PS
InChI: InChI=1/C11H15BrClO3PS/c1-3-7-18-17(14,15-4-2)16-11-6-5-9(12)8-10(11)13/h5-6,8H,3-4,7H2,1-2H3
33 atoms
Br 4.280083 -0.422763 1.11755
Cl 0.547579 0.776797 -2.749037
S  -2.510328 -1.593251 0.543655
P  -2.761902 0.366665 -0.051193
O  -1.325531 0.930995 -0.579686
O  -2.976707 1.04893 1.365143
O  -3.760713 0.624481 -1.107112
C  -2.897934 -2.457383 -1.028638
C  -1.865102 -2.305645 -2.128822
C  -0.482308 -2.811654 -1.761083
C  -0.081068 0.625171 -0.133293
C  -3.741095 2.265776 1.540406
C  0.927491 0.526296 -1.088573
C  0.235991 0.4336 1.203559
C  -3.07123 3.473069 0.93524
C  2.229165 0.225932 -0.724896
C  1.53198 0.119411 1.580653
C  2.518278 0.01337 0.613826
H  -3.88668 -2.138001 -1.354818
H  -2.98308 -3.500804 -0.718383
H  -2.245972 -2.87112 -2.984258
H  -1.817544 -1.266222 -2.459546
H  -0.507017 -3.871299 -1.499252
H  0.206952 -2.695217 -2.597637
H  -0.060761 -2.271775 -0.912229
H  -4.742241 2.11975 1.13167
H  -3.833387 2.372904 2.61949
H  -0.517037 0.535849 1.97305
H  -3.025615 3.420598 -0.153038
H  -3.653253 4.358825 1.193443
H  -2.062412 3.612335 1.324174
H  2.993041 0.15302 -1.487289
H  1.751082 -0.034741 2.628349
elementType: Br Cl S P O C H
totalener: -4428.06526095 hartree
nucrepener: 2289.17015573 hartree
electener: -6717.23541668 hartree
twoeener: 3973.10576816 hartree
cpcmener: -0.02142597 hartree
kineticenergy: 4419.41593502 hartree
xcener: -190.172388977527 hartree
chargesum: -0.0000000
charge: -0.030265 -0.067442 -0.168688 0.800200 -0.324351 -0.344470 -0.601949 -0.097877 -0.107065 -0.263816 0.227725 0.030789 0.002589 -0.162979 -0.248740 -0.053674 -0.105637 -0.063633 0.130438 0.126836 0.088203 0.057249 0.100543 0.094832 0.063864 0.105531 0.105934 0.148464 0.092133 0.100496 0.089780 0.127187 0.147794
qa: -0.0303 -0.0674 -0.1687 0.8002 -0.3244 -0.3445 -0.6019 -0.0979 -0.1071 -0.2638 0.2277 0.0308 0.0026 -0.1630 -0.2487 -0.0537 -0.1056 -0.0636 0.1304 0.1268 0.0882 0.0572 0.1005 0.0948 0.0639 0.1055 0.1059 0.1485 0.0921 0.1005 0.0898 0.1272 0.1478
va: 1.2224 1.2428 2.2842 5.4499 2.0866 2.0974 2.0095 3.8723 3.8581 3.9275 3.7899 3.8596 3.9351 3.9436 3.9053 3.9060 3.9235 3.9993 1.0208 1.0031 1.0097 1.0355 1.0059 1.0068 1.0063 1.0014 0.9907 1.0168 1.0143 1.0091 1.0039 1.0114 0.9955
dispcorr: -0.019608887 hartree
energy: -4428.084869832754
dipole: -60.83037 60.81821 -0.01216 0.72718 -0.93574 -0.20855 -9.66662 10.88090 1.21428
magnitude: 1.23211 au
magnitude: 3.13179 debye
