program: Gaussian 09
title: 000066299
version: EM64L-G09RevD.01
frameworkgroup: C1[X(C10H12O3)]
method: RPBEPBE
basis: SDD
operation: Freq
keyword: #pfreq=noraman
keyword: PBEPBE/SDD
title: #p freq=noraman PBEPBE/SDD
converged: NO YES NO NO
title: Mulliken charges:
elementType: O O O C C C C C C C C C C H H H H H H H H H H H H
charge: -0.287489 -0.266483 -0.257138 0.246550 -0.475587 0.351367 -0.359772 -0.356044 -0.205980 0.191132 -0.221729 -0.675082 -0.536727 0.290954 0.270174 0.244379 0.226659 0.229604 0.229549 0.212058 0.229554 0.229563 0.221242 0.221242 0.248003
chargesum: 0.00000
title: Mulliken charges with hydrogens summed into heavy atoms:
elementType: O O O C C C C C C C C C C
charge: -0.287489 -0.266483 -0.257138 0.246550 -0.184633 0.351367 -0.089598 -0.111665 0.020680 0.191132 0.237424 -0.003907 0.153760
polarizability: 1.82805583e+02 2.66598512e-01 1.21103846e+02 -2.74490734e-02 -5.20572259e-03 6.24298811e+01
1716.lowfreq: -35.4310 -1.2878 -0.0004 0.0004 0.0005 5.3662 16.0615 57.1415 84.1973
frequency: -26.7279 56.7095 84.1935 89.9770 107.8572 187.8374 192.5202 208.6993 252.4842 269.0735 269.3401 291.9339 364.7387 417.3584 435.8761 511.2822 539.2227 546.1095 654.4357 683.4416 728.3480 754.7154 794.6229 802.1741 809.5834 881.2119 898.8408 932.8026 981.4818 982.1899 1001.0894 1026.3194 1076.1242 1092.3784 1112.0067 1112.2130 1135.8782 1154.2354 1170.2381 1198.2365 1246.9762 1256.1879 1287.3112 1356.7562 1396.4878 1397.3326 1431.3807 1446.7209 1463.0952 1468.5611 1471.3130 1473.0213 1474.6337 1486.2815 1582.5993 1619.3940 1620.7672 2959.6546 2995.2733 3008.8826 3047.2435 3066.7410 3091.9015 3107.1691 3129.4557 3138.9503 3166.5583 3173.4233 3188.1418
redmass: 2.5271 3.7214 4.1139 3.8780 2.8448 2.4182 4.5225 1.9278 1.3904 3.5328 1.6489 5.2526 3.9959 6.0115 3.2659 5.3897 4.8994 4.6891 7.3975 2.5982 3.3896 7.7029 1.1224 1.5782 3.9281 4.9254 1.4098 1.4969 5.7841 1.3314 5.6208 2.4278 2.5176 1.6498 1.2599 2.2398 1.4718 1.4398 1.4125 1.8056 1.1326 3.9697 1.3449 1.4087 1.5229 4.1081 1.4508 2.0722 1.0408 1.0497 2.3540 1.0630 1.0961 1.0746 6.6727 7.9749 8.7073 1.0332 1.0356 1.0580 1.1040 1.1065 1.0985 1.1026 1.0991 1.0877 1.0933 1.0922 1.0959
irintensity: 0.0057 4.6855 4.2371 2.1337 0.0020 1.8592 0.5542 1.6947 1.7899 5.6789 0.6134 7.0477 11.8720 0.2758 0.6051 3.4970 5.4297 4.5443 1.1623 7.5641 56.8069 9.7958 0.0068 35.5192 10.9083 29.0509 0.3692 22.5292 5.6129 0.7590 146.8810 114.3815 162.1092 11.6290 0.2444 3.6936 5.5795 14.6003 26.4108 10.6095 0.0030 540.0167 0.4632 5.0049 23.0915 6.5520 50.6031 71.3375 12.0973 13.5992 30.5286 7.4669 8.0236 11.9207 100.9567 88.6773 91.5242 64.7088 22.2743 20.8184 49.2981 8.6891 31.9800 45.5773 24.4561 9.5584 13.3850 2.7226 5.3779
temp: 298.150 k
press: 1.00000 atm
elementType: 8 8 8 6 6 6 6 6 6 6 6 6 6 1 1 1 1 1 1 1 1 1 1 1 1
symmnumber: 1
zpe: 522528.8 jmol-1
zpe.correction: 0.199021 hartree
zpe.thermalcorrener: 0.211250 hartree
zpe.thermalcorrenthalpy: 0.212194 hartree
zpe.thermalcorrgfe: 0.160286 hartree
zpe.sumelectzpe: -612.957034 hartree
zpe.sumelectthermal: -612.944804 hartree
zpe.sumelectthermalent: -612.943860 hartree
zpe.sumelectthermalfe: -612.995769 hartree
dipole: -1.1777 3.0707 0.0027
dipole: 3.2888
quadrupole: -47.6581 -80.0022 -78.5801
quadrupole: -2.1056 -0.0051 0.0007
quadrupole: 21.0887 -11.2554 -9.8333 -2.1056 -0.0051 0.0007
hfenergy: -613.1560545 hartree
pointgroup: C01 [X(C10H12O3)]
dipole: 0.473549 1.2041365 -0.0013001 debye
dipolederiv: -1.8404625 0.2041675 -0.0007241 0.4464863 -0.5594744 -0.000029 -0.0024587 0.0005622 -0.2772734 -1.577115 0.3630647 0.0010284 0.5947116 -0.4790992 -0.0005002 0.0011058 -0.0003265 -0.3017766 -0.7802627 -0.1832891 0.0001577 -0.0236991 -0.9637587 0.0012317 0.0001049 -0.0010127 -0.322445 -0.4763698 -0.2685724 -0.0000089 -0.2281588 0.0389552 0.0000798 0.0006247 0.0002557 -0.0092341 -0.2817704 0.3168411 0.0000389 -0.157111 -0.018706 0.000009 0.0006207 -0.0001854 -0.1380032 1.1707716 -0.5796509 -0.0008354 -0.9286141 0.2978728 0.0007879 -0.0009696 0.0005787 0.1032791 -0.0952825 -0.1077673 -0.0001054 0.1313789 -0.1549048 -0.0001292 0.0003628 0.0002892 -0.1573732 -0.1318546 -0.0229503 -0.0001281 0.3465687 -0.1445625 -0.0003293 -0.0001083 0.000021 -0.1990424 0.0211922 0.100907 -0.0001773 -0.0269436 0.1833569 -0.000025 -0.0001879 -0.0002605 -0.1357435 2.146035 0.140778 0.0000764 -0.2605969 1.2563638 -0.0012853 0.0000093 0.0000026 0.2281548 1.0560101 -0.0267414 0.0005416 0.0970639 0.2430012 0.0001026 0.0008764 -0.0000986 0.3562109 -0.1038923 0.0871193 -0.0001412 0.0633849 -0.0147496 0.0001703 -0.0002242 0.0001617 0.0622569 0.8679587 -0.0575171 -0.0004517 0.2369156 0.1967917 -0.0001778 -0.0005743 0.0000557 0.3294043 0.1522843 -0.0102631 0.0000448 0.0190461 0.0275572 0.000024 0.0000666 0.0000155 0.1683483 0.0385473 0.0786598 0.0001688 0.0866825 0.0679806 -0.0000251 0.000179 -0.0000146 0.1648181 -0.0764372 -0.0720008 0.0002314 -0.076848 0.0794827 0.0000844 0.0002842 0.000109 0.166397 0.0677481 -0.0170714 0.0000571 -0.0245737 -0.1231984 0.0000428 0.000001 0.0000736 0.1524295 -0.0695912 0.0237744 0.0170101 -0.0616497 -0.0016984 -0.0924867 -0.0263701 -0.0988233 -0.0600945 -0.0696292 0.0234342 -0.0168891 -0.0619865 -0.0016647 0.0924126 0.0264624 0.0989343 -0.0602195 -0.1699175 -0.0607051 -0.0003317 -0.0829247 0.0509302 -0.0001187 -0.0004162 -0.0000813 0.1155516 0.1199781 -0.0255817 -0.0405879 0.0348612 0.005127 -0.1020624 -0.0125062 -0.1129412 -0.0645677 0.1198368 -0.0258999 0.0410513 0.0345479 0.0052172 0.1020995 0.0130694 0.112828 -0.0644844 -0.0201476 0.0138826 0.0039717 -0.1533828 0.0164369 -0.1240625 -0.0561928 -0.0958641 -0.0902567 -0.0200331 0.014095 -0.0041469 -0.1531017 0.0165055 0.124313 0.0560863 0.0957987 -0.0904257 -0.0475965 0.0912871 0.0001495 0.147943 -0.0237623 -0.0001264 0.0001547 -0.0000778 0.1240895 unknown
polarizability: 182.7966242|-0.7892097|121.1127901|-0.0498957|-0.0023159|62.4298952 unknown
InChI: InChI=1S/C10H12O3/c1-3-13-10(11)8-5-4-6-9(7-8)12-2/h4-7H,3H2,1-2H3
charge 0 multiplicity 1
25 atoms
O  -2.569166 0.23292 0.002033
O  3.354617 -1.012785 -0.000854
O  -1.648501 -1.907565 0.001761
C  -0.176575 0.045253 0.002472
C  0.990311 -0.750154 0.001367
C  2.262386 -0.13242 0.000042
C  -0.082027 1.463726 0.002091
C  2.368842 1.281692 -0.000291
C  1.190258 2.06534 0.000743
C  -1.49254 -0.660808 0.004039
C  -3.926894 -0.389787 0.000108
C  -4.935201 0.754305 -0.001591
C  4.698369 -0.428096 -0.002359
H  0.910107 -1.841048 0.001638
H  -0.995073 2.063274 0.002933
H  3.345527 1.774311 -0.001331
H  1.27658 3.15745 0.000485
H  -4.0121 -1.033902 -0.893869
H  -4.014722 -1.033559 0.894077
H  -5.962575 0.34667 -0.003018
H  -4.814605 1.387458 0.893902
H  -4.811994 1.38713 -0.896962
H  4.872076 0.186535 0.902495
H  4.870159 0.186267 -0.90776
H  5.382744 -1.288508 -0.002952
