program: Orca
programVersion: 5.0.2
elementType: Br Cl S P O O O C C C C C C C C C C C H H H H H H H H H H H H H H H
charge: 0
multiplicity: 1
keywords: wb97x-d3
keywords: def2-TZVPP
keywords: def2/J RIJCOSX
keywords: DEFGRID2
keywords: scfconv7
keywords: smallprint printgap noloewdin
keywords: NOSOSCF
formula: C11H15BrClO3PS
InChI: InChI=1/C11H15BrClO3PS/c1-3-7-18-17(14,15-4-2)16-11-6-5-9(12)8-10(11)13/h5-6,8H,3-4,7H2,1-2H3
33 atoms
Br 4.372222 -0.609662 1.121083
Cl 0.71955 0.458553 -2.855448
S  -2.512729 -1.178003 0.597443
P  -2.564303 0.725617 -0.202674
O  -1.080965 1.128635 -0.715461
O  -2.675725 1.646091 1.087881
O  -3.531856 0.928861 -1.298706
C  -2.985033 -2.185664 -0.860816
C  -1.922227 -2.281077 -1.938922
C  -0.607631 -2.878349 -1.468654
C  0.12427 0.718903 -0.239755
C  -3.926536 1.799328 1.800992
C  1.095945 0.380353 -1.177678
C  0.436342 0.658648 1.109592
C  -4.682211 3.00968 1.316609
C  2.362233 -0.014927 -0.781334
C  1.697215 0.256257 1.520652
C  2.651088 -0.076506 0.572637
H  -3.925356 -1.799895 -1.251183
H  -3.191454 -3.167186 -0.429614
H  -2.343623 -2.903636 -2.73359
H  -1.75694 -1.298975 -2.386867
H  0.101359 -2.949613 -2.293671
H  -0.140832 -2.277043 -0.687526
H  -0.7513 -3.884454 -1.069599
H  -4.530746 0.893367 1.709127
H  -3.647124 1.901582 2.848467
H  -0.29055 0.939262 1.859624
H  -5.007143 2.898433 0.282388
H  -5.57131 3.14289 1.934133
H  -4.080569 3.915018 1.399952
H  3.099463 -0.272634 -1.529578
H  1.916228 0.216255 2.578774
elementType: Br Cl S P O C H
totalener: -4428.06700853 hartree
nucrepener: 2275.62105657 hartree
electener: -6703.68806510 hartree
twoeener: 3959.54004988 hartree
cpcmener: -0.02193899 hartree
kineticenergy: 4419.41153289 hartree
xcener: -190.171821319714 hartree
chargesum: 0.0000000
charge: -0.028419 -0.065290 -0.180822 0.799276 -0.325846 -0.339317 -0.598925 -0.087804 -0.106170 -0.264948 0.212963 0.050860 -0.000652 -0.159624 -0.241753 -0.048985 -0.104408 -0.065508 0.128358 0.126455 0.087919 0.056724 0.095871 0.065170 0.100565 0.089477 0.105843 0.158350 0.081748 0.095286 0.088416 0.127336 0.147853
qa: -0.0284 -0.0653 -0.1808 0.7993 -0.3258 -0.3393 -0.5989 -0.0878 -0.1062 -0.2649 0.2130 0.0509 -0.0007 -0.1596 -0.2418 -0.0490 -0.1044 -0.0655 0.1284 0.1265 0.0879 0.0567 0.0959 0.0652 0.1006 0.0895 0.1058 0.1583 0.0817 0.0953 0.0884 0.1273 0.1479
va: 1.2241 1.2454 2.2813 5.5066 2.1234 2.1135 2.0206 3.8646 3.8641 3.9252 3.8129 3.8532 3.9305 3.9479 3.9413 3.8881 3.9257 4.0024 1.0228 1.0034 1.0113 1.0339 1.0063 1.0068 1.0059 1.0045 0.9911 1.0089 1.0181 1.0073 1.0047 1.0111 0.9955
dispcorr: -0.019077566 hartree
energy: -4428.086086092381
dipole: -67.55496 67.12002 -0.43495 0.13016 -0.98272 -0.85255 -6.10602 7.79336 1.68735
magnitude: 1.93989 au
magnitude: 4.93080 debye
