program: Orca
programVersion: 5.0.2
elementType: Br Cl S P O O O C C C C C C C C C C C H H H H H H H H H H H H H H H
charge: 0
multiplicity: 1
keywords: wb97x-d3
keywords: def2-TZVPP
keywords: def2/J RIJCOSX
keywords: DEFGRID2
keywords: scfconv7
keywords: smallprint printgap noloewdin
keywords: NOSOSCF
formula: C11H15BrClO3PS
InChI: InChI=1/C11H15BrClO3PS/c1-3-7-18-17(14,15-4-2)16-11-6-5-9(12)8-10(11)13/h5-6,8H,3-4,7H2,1-2H3
33 atoms
Br 4.588136 0.638173 1.319022
Cl 0.223681 2.70208 -1.331585
S  -2.410081 -1.937594 0.159646
P  -2.147416 -0.097992 -0.742446
O  -0.691545 -0.075218 -1.46033
O  -1.879663 0.851761 0.497963
O  -3.183676 0.241823 -1.736449
C  -3.134948 -2.88297 -1.241011
C  -3.511195 -4.278954 -0.773142
C  -4.622721 -4.308213 0.263322
C  0.491224 0.074677 -0.797368
C  -2.949031 1.355871 1.332617
C  1.049403 1.34255 -0.675125
C  1.167918 -1.02396 -0.297882
C  -3.540978 2.621808 0.768459
C  2.272648 1.517699 -0.049958
C  2.391901 -0.864867 0.332096
C  2.929814 0.406489 0.456213
H  -2.398926 -2.930215 -2.042415
H  -4.011409 -2.346491 -1.601577
H  -3.831573 -4.823857 -1.664924
H  -2.626274 -4.800704 -0.400899
H  -5.512041 -3.788269 -0.097574
H  -4.91038 -5.33512 0.490413
H  -4.326422 -3.840959 1.203789
H  -3.712847 0.586485 1.46984
H  -2.485705 1.535925 2.300982
H  0.743165 -2.01277 -0.410113
H  -4.061639 2.446567 -0.172173
H  -4.265138 3.01968 1.480642
H  -2.777306 3.383409 0.610293
H  2.691456 2.511382 0.034816
H  2.906569 -1.735153 0.715419
elementType: Br Cl S P O C H
totalener: -4428.06587323 hartree
nucrepener: 2222.64683446 hartree
electener: -6650.71270770 hartree
twoeener: 3906.84972101 hartree
cpcmener: -0.02218687 hartree
kineticenergy: 4419.42315647 hartree
xcener: -190.170311744037 hartree
chargesum: -0.0000000
charge: -0.028438 -0.062381 -0.188516 0.806324 -0.350782 -0.324097 -0.595688 -0.087777 -0.111028 -0.254365 0.245818 0.037835 -0.011883 -0.168348 -0.240980 -0.051693 -0.093217 -0.069354 0.130036 0.112053 0.079880 0.073268 0.084055 0.093397 0.076925 0.093912 0.107917 0.152218 0.084567 0.097277 0.084365 0.130459 0.148241
qa: -0.0284 -0.0624 -0.1885 0.8063 -0.3508 -0.3241 -0.5957 -0.0878 -0.1110 -0.2544 0.2458 0.0378 -0.0119 -0.1683 -0.2410 -0.0517 -0.0932 -0.0694 0.1300 0.1121 0.0799 0.0733 0.0841 0.0934 0.0769 0.0939 0.1079 0.1522 0.0846 0.0973 0.0844 0.1305 0.1482
va: 1.2234 1.2521 2.2902 5.5085 2.1117 2.1023 2.0253 3.8886 3.9188 3.9331 3.7889 3.8541 3.9990 4.0338 3.9327 3.8939 3.9025 3.9995 1.0047 1.0206 1.0053 1.0120 1.0014 1.0046 1.0069 1.0031 0.9912 1.0030 1.0180 1.0092 1.0078 1.0087 0.9942
dispcorr: -0.016199233 hartree
energy: -4428.082072466368
dipole: -77.26141 77.02328 -0.23814 -26.45154 25.08374 -1.36780 -7.98023 9.30474 1.32451
magnitude: 1.91883 au
magnitude: 4.87727 debye
