program: Gaussian 09
title: 000066296
version: EM64L-G09RevD.01
frameworkgroup: C1[X(C3H5NO3)]
method: RPBEPBE
basis: SDD
operation: Freq
keyword: #pfreq=noraman
keyword: PBEPBE/SDD
title: #p freq=noraman PBEPBE/SDD
converged: NO YES NO NO
title: Mulliken charges:
elementType: O O O N C C C H H H H H
charge: -0.162608 -0.189318 -0.188637 0.155908 -0.412757 0.237908 -0.738792 0.267583 0.268656 0.245134 0.273099 0.243823
chargesum: 0.00000
title: Mulliken charges with hydrogens summed into heavy atoms:
elementType: O O O N C C C
charge: -0.162608 -0.189318 -0.188637 0.155908 0.123482 0.237908 0.023264
polarizability: 5.69294446e+01 3.80758260e+00 4.51808857e+01 -8.24291689e-03 -2.31195016e-01 4.88918774e+01
1716.lowfreq: -52.0553 -9.6970 -7.0580 -0.0009 -0.0005 0.0010 8.6113 43.7520 84.3762
frequency: -51.6451 43.5026 84.3285 156.6214 315.9965 419.9086 459.7879 497.9286 583.7680 694.1099 813.3879 857.0572 871.0899 963.9168 1046.4378 1165.0401 1171.2240 1222.2677 1296.8617 1374.8588 1413.1138 1435.5736 1443.0237 1454.2933 1668.9262 2986.0613 3038.7766 3068.9035 3114.9197 3131.3576
redmass: 1.6358 9.9379 1.6269 8.9254 3.6282 2.1231 3.0266 6.3612 5.8030 7.5113 3.4708 1.4598 6.7675 2.2285 1.8713 2.6173 1.2599 4.8721 1.7942 1.2257 1.0878 5.3880 1.0664 1.0788 8.4884 1.0377 1.0569 1.0966 1.1059 1.0996
irintensity: 0.0318 2.1080 0.3266 1.1777 0.2938 0.6251 0.0176 4.6366 28.2419 5.9245 0.3383 0.7891 11.9605 17.6106 0.0380 114.7515 23.9073 126.3367 36.7821 52.7205 21.6339 132.1285 30.3035 53.7951 97.1450 1.9482 4.4389 7.3235 0.1328 6.1302
temp: 298.150 k
press: 1.00000 atm
elementType: 8 8 8 7 6 6 6 1 1 1 1 1
symmnumber: 1
zpe: 220071.3 jmol-1
zpe.correction: 0.083821 hartree
zpe.thermalcorrener: 0.090728 hartree
zpe.thermalcorrenthalpy: 0.091672 hartree
zpe.thermalcorrgfe: 0.051641 hartree
zpe.sumelectzpe: -397.093097 hartree
zpe.sumelectthermal: -397.086190 hartree
zpe.sumelectthermalent: -397.085246 hartree
zpe.sumelectthermalfe: -397.125277 hartree
dipole: -4.5101 -4.4099 -0.1508
dipole: 6.3096
quadrupole: -42.2139 -41.2519 -42.7295
quadrupole: 1.4805 0.0040 0.1005
quadrupole: -0.1488 0.8132 -0.6644 1.4805 0.0040 0.1005
hfenergy: -397.1769175 hartree
pointgroup: C01 [X(C3H5N1O3)]
dipole: -1.7422045 -1.7445001 -0.2891861 debye
dipolederiv: -0.4717399 -0.0553066 -0.0064252 0.1130711 -0.7976074 -0.0941124 0.021323 -0.0907062 -0.250067 -0.4472889 -0.0523924 -0.1893776 -0.1969223 -0.2317636 0.0098006 -0.0942685 0.1176222 -0.7332601 -0.4457998 -0.1130916 0.1621022 -0.218125 -0.2469344 0.1634844 0.0225046 0.0544414 -0.7168266 0.8898392 0.2925084 0.0498682 0.7027804 0.2089867 -0.1847191 0.1209409 -0.1821939 1.2394892 -0.5792385 0.1148164 0.0242918 0.1791919 -0.0865189 -0.0406851 0.0413322 -0.0434223 0.1282707 1.2288515 -0.0298587 -0.0194664 -0.4039234 0.9893469 0.1507293 -0.0832741 0.1482303 0.1135113 -0.4570994 -0.1766386 -0.0232149 -0.1149645 -0.1419664 -0.0248519 -0.0116291 -0.0233712 0.027285 0.0567672 -0.0165443 0.0011134 -0.0749029 0.0599513 0.0390673 -0.0149678 0.0834419 0.0561753 0.0554776 -0.0150629 -0.0067231 -0.0741272 0.0997554 -0.0218391 -0.0139832 -0.0658857 0.0182698 0.0955311 0.0074259 -0.0384515 -0.0036913 0.0336293 0.103115 0.0099762 0.1131032 0.0241256 -0.0211391 0.0489848 0.0077178 0.0915934 0.0200637 -0.0174263 0.0141288 -0.0179183 0.1305909 0.095839 -0.0048405 0.0385653 0.0000195 0.0930576 -0.0825628 -0.0120831 -0.0933413 -0.037564 unknown
polarizability: 56.7840247|3.9904665|45.4589034|0.5004145|-0.7207628|48.7592795 unknown
InChI: InChI=1S/C3H5NO3/c1-3(5)2-4(6)7/h2H2,1H3
charge 0 multiplicity 1
12 atoms
O  -1.006281 1.349912 0.224313
O  1.819721 -0.110522 1.139947
O  1.821902 0.279313 -1.115505
N  1.310302 -0.197763 -0.037159
C  -0.035101 -0.874832 -0.15475
C  -1.20152 0.132465 0.029852
C  -2.579623 -0.502136 -0.061781
H  -0.085998 -1.654899 0.622662
H  -0.091938 -1.332735 -1.156263
H  -2.708259 -1.270375 0.72389
H  -3.353644 0.270553 0.056889
H  -2.714562 -1.007682 -1.036594
