program: Orca
programVersion: 5.0.2
elementType: Br Cl S P O O O C C C C C C C C C C C H H H H H H H H H H H H H H H
charge: 0
multiplicity: 1
keywords: wb97x-d3
keywords: def2-TZVPP
keywords: def2/J RIJCOSX
keywords: DEFGRID2
keywords: scfconv7
keywords: smallprint printgap noloewdin
keywords: NOSOSCF
formula: C11H15BrClO3PS
InChI: InChI=1/C11H15BrClO3PS/c1-3-7-18-17(14,15-4-2)16-11-6-5-9(12)8-10(11)13/h5-6,8H,3-4,7H2,1-2H3
33 atoms
Br 4.539993 -0.729134 -0.582331
Cl 0.165318 0.057937 2.671435
S  -3.063809 -0.629199 0.815541
P  -2.298912 0.887873 -0.363047
O  -0.972832 1.475445 0.373648
O  -3.214534 2.13815 -0.026569
O  -2.100317 0.509995 -1.779109
C  -2.6369 -2.119365 -0.159856
C  -1.179981 -2.531328 -0.064639
C  -0.935952 -3.844515 -0.793696
C  0.267767 0.959164 0.131667
C  -4.561606 2.228178 -0.548342
C  0.927217 0.269256 1.143275
C  0.896813 1.150487 -1.088162
C  -4.958776 3.680061 -0.574402
C  2.201359 -0.237667 0.938058
C  2.167832 0.647468 -1.308307
C  2.806098 -0.050302 -0.294735
H  -2.953717 -1.96674 -1.1910
H  -3.283938 -2.889866 0.264746
H  -0.544296 -1.75475 -0.495858
H  -0.89411 -2.626211 0.984855
H  -1.187536 -3.766062 -1.852768
H  0.112556 -4.13607 -0.725236
H  -1.531256 -4.655152 -0.36968
H  -4.603306 1.800289 -1.551958
H  -5.224611 1.648931 0.096318
H  0.403669 1.713773 -1.868629
H  -4.940205 4.12055 0.422728
H  -4.307253 4.260841 -1.227907
H  -5.976496 3.762578 -0.957134
H  2.698645 -0.771926 1.736473
H  2.642409 0.812326 -2.265808
elementType: Br Cl S P O C H
totalener: -4428.06779997 hartree
nucrepener: 2256.37407598 hartree
electener: -6684.44187595 hartree
twoeener: 3940.67730295 hartree
cpcmener: -0.01944006 hartree
kineticenergy: 4419.41219223 hartree
xcener: -190.166753179334 hartree
chargesum: -0.0000000
charge: -0.028734 -0.061994 -0.174758 0.827592 -0.342165 -0.346101 -0.597306 -0.070454 -0.083478 -0.266979 0.209776 0.026545 -0.012966 -0.142463 -0.241684 -0.056432 -0.090093 -0.064802 0.113630 0.125578 0.050314 0.064272 0.085908 0.092828 0.086392 0.105423 0.102873 0.146695 0.089571 0.088357 0.088512 0.127834 0.148311
qa: -0.0287 -0.0620 -0.1748 0.8276 -0.3422 -0.3461 -0.5973 -0.0705 -0.0835 -0.2670 0.2098 0.0265 -0.0130 -0.1425 -0.2417 -0.0564 -0.0901 -0.0648 0.1136 0.1256 0.0503 0.0643 0.0859 0.0928 0.0864 0.1054 0.1029 0.1467 0.0896 0.0884 0.0885 0.1278 0.1483
va: 1.2231 1.2449 2.3025 5.4929 2.1238 2.1424 1.9932 3.8498 3.8986 3.9668 3.8301 3.8546 3.9774 3.9915 3.9701 3.8997 3.8845 3.9915 1.0263 1.0042 1.0196 1.0171 1.0006 1.0036 1.0011 0.9921 0.9954 1.0105 1.0026 1.0058 1.0062 1.0105 0.9940
dispcorr: -0.017732437 hartree
energy: -4428.085532405745
dipole: -68.14535 67.11712 -1.02822 1.70643 -2.05729 -0.35086 -6.34101 6.22299 -0.11802
magnitude: 1.09283 au
magnitude: 2.77775 debye
