program: Orca
programVersion: 5.0.2
elementType: Br Cl S P O O O C C C C C C C C C C C H H H H H H H H H H H H H H H
charge: 0
multiplicity: 1
keywords: wb97x-d3
keywords: def2-TZVPP
keywords: def2/J RIJCOSX
keywords: DEFGRID2
keywords: scfconv7
keywords: smallprint printgap noloewdin
keywords: NOSOSCF
formula: C11H15BrClO3PS
InChI: InChI=1/C11H15BrClO3PS/c1-3-7-18-17(14,15-4-2)16-11-6-5-9(12)8-10(11)13/h5-6,8H,3-4,7H2,1-2H3
33 atoms
Br 4.419643 1.816126 0.830287
Cl 0.80763 -1.095794 -2.130498
S  -3.613924 -1.753359 0.512505
P  -2.196233 -0.3517 -0.017237
O  -0.809707 -1.124886 0.355243
O  -2.266559 0.721308 1.154772
O  -2.279388 0.178177 -1.395302
C  -4.302399 -2.283486 -1.10675
C  -3.701074 -3.565146 -1.648881
C  -2.229657 -3.469993 -2.007502
C  0.370338 -0.435435 0.452109
C  -2.681668 2.08885 0.929542
C  1.22404 -0.341923 -0.640944
C  0.742501 0.132422 1.659703
C  -1.50451 2.960359 0.574398
C  2.434464 0.32749 -0.535094
C  1.947986 0.801769 1.781429
C  2.781987 0.899288 0.678302
H  -4.207414 -1.45772 -1.810609
H  -5.366154 -2.413409 -0.90507
H  -3.865309 -4.378007 -0.937841
H  -4.28019 -3.820183 -2.541668
H  -1.605004 -3.337584 -1.124285
H  -1.895889 -4.382771 -2.502306
H  -2.036976 -2.63757 -2.68577
H  -3.45298 2.128124 0.158597
H  -3.136049 2.404714 1.867653
H  0.092545 0.041657 2.519172
H  -0.742007 2.940225 1.352992
H  -1.048838 2.662936 -0.370282
H  -1.844419 3.991679 0.469186
H  3.083183 0.393234 -1.398114
H  2.216166 1.238547 2.733494
elementType: Br Cl S P O C H
totalener: -4428.06408189 hartree
nucrepener: 2262.56559771 hartree
electener: -6690.62967960 hartree
twoeener: 3947.21695509 hartree
cpcmener: -0.01991686 hartree
kineticenergy: 4419.41619066 hartree
xcener: -190.166838713409 hartree
chargesum: 0.0000000
charge: -0.027720 -0.059985 -0.173896 0.832107 -0.344319 -0.364992 -0.593297 -0.098097 -0.082159 -0.258636 0.278366 0.040000 -0.014139 -0.216687 -0.251866 -0.068598 -0.066161 -0.069156 0.116004 0.126892 0.066816 0.073433 0.066301 0.098539 0.076688 0.098908 0.106070 0.149621 0.086743 0.088149 0.106263 0.129216 0.149588
qa: -0.0277 -0.0600 -0.1739 0.8321 -0.3443 -0.3650 -0.5933 -0.0981 -0.0822 -0.2586 0.2784 0.0400 -0.0141 -0.2167 -0.2519 -0.0686 -0.0662 -0.0692 0.1160 0.1269 0.0668 0.0734 0.0663 0.0985 0.0767 0.0989 0.1061 0.1496 0.0867 0.0881 0.1063 0.1292 0.1496
va: 1.2244 1.2514 2.2905 5.4563 2.0949 2.1059 1.9964 3.8634 3.8888 3.9250 3.7052 3.8600 4.0439 3.9940 3.9084 3.9122 3.8335 4.0008 1.0308 1.0044 1.0118 1.0090 1.0187 1.0079 1.0086 1.0028 0.9929 1.0094 1.0029 1.0143 1.0106 1.0098 0.9919
dispcorr: -0.018628546 hartree
energy: -4428.082710433735
dipole: -66.65587 65.74269 -0.91318 -21.20695 21.51401 0.30706 -9.73640 10.70819 0.97179
magnitude: 1.36842 au
magnitude: 3.47823 debye
