program: Orca
programVersion: 5.0.2
elementType: Br Cl S P O O O C C C C C C C C C C C H H H H H H H H H H H H H H H
charge: 0
multiplicity: 1
keywords: wb97x-d3
keywords: def2-TZVPP
keywords: def2/J RIJCOSX
keywords: DEFGRID2
keywords: scfconv7
keywords: smallprint printgap noloewdin
keywords: NOSOSCF
formula: C11H15BrClO3PS
InChI: InChI=1/C11H15BrClO3PS/c1-3-7-18-17(14,15-4-2)16-11-6-5-9(12)8-10(11)13/h5-6,8H,3-4,7H2,1-2H3
33 atoms
Br 4.419066 0.135767 1.330683
Cl 0.340413 2.706466 -1.332966
S  -2.639599 -1.596305 0.352785
P  -2.352899 0.148604 -0.70884
O  -0.911242 0.059367 -1.450546
O  -2.040683 1.195719 0.437664
O  -3.398528 0.433714 -1.709745
C  -3.291722 -2.673051 -0.988638
C  -3.232218 -4.127471 -0.553124
C  -1.821321 -4.668548 -0.389067
C  0.284091 0.066664 -0.790241
C  -3.083986 1.865467 1.183667
C  0.991491 1.258108 -0.670057
C  0.825396 -1.104894 -0.28912
C  -3.487226 3.154843 0.515373
C  2.227985 1.284716 -0.045368
C  2.058506 -1.09356 0.34274
C  2.74523 0.104072 0.465547
H  -2.695138 -2.523162 -1.888754
H  -4.315337 -2.366858 -1.195435
H  -3.805429 -4.267298 0.367012
H  -3.754922 -4.70002 -1.323752
H  -1.283912 -4.179112 0.424448
H  -1.841535 -5.73592 -0.166901
H  -1.239494 -4.533233 -1.302758
H  -3.941094 1.20135 1.317301
H  -2.6538 2.049034 2.16673
H  0.288522 -2.037278 -0.402175
H  -2.629741 3.811881 0.369302
H  -3.963513 2.98144 -0.449213
H  -4.20233 3.675922 1.152913
H  2.766042 2.219546 0.034869
H  2.462008 -2.018239 0.731973
elementType: Br Cl S P O C H
totalener: -4428.06596930 hartree
nucrepener: 2242.44500507 hartree
electener: -6670.51097437 hartree
twoeener: 3926.48926118 hartree
cpcmener: -0.02266933 hartree
kineticenergy: 4419.42221328 hartree
xcener: -190.170461542535 hartree
chargesum: 0.0000000
charge: -0.028820 -0.062450 -0.182872 0.799081 -0.348625 -0.325178 -0.595836 -0.090132 -0.097991 -0.271459 0.203330 0.036488 0.017407 -0.120757 -0.239976 -0.076686 -0.141466 -0.035903 0.113249 0.124385 0.074448 0.079665 0.075730 0.102529 0.084180 0.096140 0.108469 0.163622 0.083572 0.084333 0.097666 0.129421 0.144434
qa: -0.0288 -0.0624 -0.1829 0.7991 -0.3486 -0.3252 -0.5958 -0.0901 -0.0980 -0.2715 0.2033 0.0365 0.0174 -0.1208 -0.2400 -0.0767 -0.1415 -0.0359 0.1132 0.1244 0.0744 0.0797 0.0757 0.1025 0.0842 0.0961 0.1085 0.1636 0.0836 0.0843 0.0977 0.1294 0.1444
va: 1.2229 1.2510 2.2869 5.5203 2.1080 2.1064 2.0244 3.8917 3.8998 3.9368 3.8301 3.8540 3.9799 3.9901 3.9358 3.9233 3.9649 3.9818 1.0119 1.0149 1.0106 1.0058 1.0049 1.0058 0.9992 1.0010 0.9913 0.9778 1.0078 1.0174 1.0091 1.0104 0.9985
dispcorr: -0.016946087 hartree
energy: -4428.082915388976
dipole: -68.34600 68.16219 -0.18381 -20.35753 19.08047 -1.27707 -10.06939 11.38487 1.31548
magnitude: 1.84260 au
magnitude: 4.68352 debye
