program: Orca
programVersion: 5.0.2
elementType: Br Cl S P O O O C C C C C C C C C C C H H H H H H H H H H H H H H H
charge: 0
multiplicity: 1
keywords: wb97x-d3
keywords: def2-TZVPP
keywords: def2/J RIJCOSX
keywords: DEFGRID2
keywords: scfconv7
keywords: smallprint printgap noloewdin
keywords: NOSOSCF
formula: C11H15BrClO3PS
InChI: InChI=1/C11H15BrClO3PS/c1-3-7-18-17(14,15-4-2)16-11-6-5-9(12)8-10(11)13/h5-6,8H,3-4,7H2,1-2H3
33 atoms
Br 4.974815 0.522499 -0.545839
Cl 0.579765 -0.402799 2.643736
S  -1.943386 -1.777358 0.519079
P  -2.074251 0.115319 -0.278395
O  -0.923611 0.928921 0.537904
O  -3.363142 0.75828 0.385991
O  -1.967347 0.197788 -1.751779
C  -2.775418 -2.739324 -0.805296
C  -4.266875 -2.496603 -0.946842
C  -5.06151 -2.716436 0.327731
C  0.405081 0.812905 0.246898
C  -3.865241 2.039485 -0.071962
C  1.243352 0.214627 1.180705
C  0.939015 1.327705 -0.922854
C  -4.961986 1.857863 -1.089008
C  2.607231 0.126393 0.952894
C  2.299814 1.243532 -1.166066
C  3.121738 0.6392 -0.227222
H  -2.580275 -3.773588 -0.515185
H  -2.247065 -2.562596 -1.74081
H  -4.449272 -1.493126 -1.338172
H  -4.615662 -3.1853 -1.721725
H  -4.808433 -1.982738 1.093334
H  -6.130974 -2.630362 0.133761
H  -4.8804 -3.708825 0.744691
H  -4.235821 2.536837 0.822678
H  -3.054557 2.650934 -0.473239
H  0.295353 1.816046 -1.641783
H  -4.595985 1.386332 -2.000267
H  -5.783212 1.262826 -0.689937
H  -5.360724 2.836709 -1.358938
H  3.243273 -0.340286 1.692656
H  2.698194 1.653636 -2.083778
elementType: Br Cl S P O C H
totalener: -4428.06763979 hartree
nucrepener: 2229.44562658 hartree
electener: -6657.51326637 hartree
twoeener: 3914.05665254 hartree
cpcmener: -0.01990878 hartree
kineticenergy: 4419.43299527 hartree
xcener: -190.170294340936 hartree
chargesum: 0.0000000
charge: -0.028659 -0.060939 -0.174929 0.835951 -0.364030 -0.340060 -0.600900 -0.103501 -0.094220 -0.259907 0.249120 0.052265 -0.038685 -0.178780 -0.258813 -0.047140 -0.083322 -0.073980 0.128893 0.126381 0.059985 0.084717 0.073399 0.094674 0.087815 0.106506 0.097978 0.152570 0.085965 0.090701 0.102131 0.130403 0.148411
qa: -0.0287 -0.0609 -0.1749 0.8360 -0.3640 -0.3401 -0.6009 -0.1035 -0.0942 -0.2599 0.2491 0.0523 -0.0387 -0.1788 -0.2588 -0.0471 -0.0833 -0.0740 0.1289 0.1264 0.0600 0.0847 0.0734 0.0947 0.0878 0.1065 0.0980 0.1526 0.0860 0.0907 0.1021 0.1304 0.1484
va: 1.2230 1.2503 2.3151 5.4798 2.1249 2.0883 1.9809 3.8847 3.8771 3.9330 3.7970 3.8567 4.0235 4.0311 3.9261 3.8910 3.8769 3.9975 1.0007 1.0249 1.0174 1.0092 1.0146 1.0050 1.0015 0.9937 0.9987 1.0114 1.0140 1.0013 1.0101 1.0080 0.9940
dispcorr: -0.016969926 hartree
energy: -4428.084609713574
dipole: -88.92464 87.72726 -1.19738 -9.54204 9.73868 0.19665 -6.81193 6.55118 -0.26074
magnitude: 1.24112 au
magnitude: 3.15468 debye
