program: Gaussian 09
title: 000066293
version: EM64L-G09RevD.01
frameworkgroup: C1[X(C2H6BrN)]
method: RPBEPBE
basis: SDD
operation: Freq
keyword: #p
keyword: freq=noraman
keyword: PBEPBE/SDD
title: #p freq=noraman PBEPBE/SDD
converged: NO YES NO NO
title: Mulliken charges:
elementType: Br N C C H H H H H H
charge: 0.002167 -0.257305 -0.595582 -0.595582 0.223655 0.238358 0.261138 0.238358 0.223655 0.261138
chargesum: 0.00000
title: Mulliken charges with hydrogens summed into heavy atoms:
elementType: Br N C C
charge: 0.002167 -0.257305 0.127569 0.127569
polarizability: 6.89530798e+01 9.38714833e-04 3.87269216e+01 2.39208465e+00 -1.41989382e-04 2.86237178e+01
1716.lowfreq: -24.1687 -10.5833 -7.4679 -0.0004 0.0001 0.0004 248.5314 253.6855 284.9961
frequency: 248.5237 253.6695 284.9817 301.3021 363.1506 471.6114 855.9518 965.1560 1067.7906 1123.2376 1157.3300 1176.9452 1401.1590 1418.4144 1430.7307 1445.8029 1462.6280 1480.2265 2927.1143 2932.8012 3024.4687 3030.2788 3107.8385 3111.1447
redmass: 1.0759 1.4152 2.7527 1.9561 2.7131 3.3594 4.9123 1.7364 1.2216 1.4570 3.0934 1.5505 1.1317 1.1371 1.0502 1.0486 1.0506 1.0547 1.0417 1.0415 1.0944 1.0920 1.0967 1.0979
irintensity: 0.8624 3.8366 0.0017 7.0833 10.9493 12.9843 8.4545 2.6711 0.2998 37.9440 1.9430 21.5818 5.3761 0.7423 14.5102 15.4245 0.8645 21.2874 32.1741 99.0859 0.6181 49.9671 22.5794 10.2866
temp: 298.150 k
press: 1.00000 atm
elementType: 35 7 6 6 1 1 1 1 1 1
symmnumber: 1
zpe: 209599.2 jmol-1
zpe.correction: 0.079832 hartree
zpe.thermalcorrener: 0.085319 hartree
zpe.thermalcorrenthalpy: 0.086263 hartree
zpe.thermalcorrgfe: 0.050484 hartree
zpe.sumelectzpe: -147.629164 hartree
zpe.sumelectthermal: -147.623678 hartree
zpe.sumelectthermalent: -147.622734 hartree
zpe.sumelectthermalfe: -147.658513 hartree
dipole: -2.4809 0.0000 1.3321
dipole: 2.8159
quadrupole: -30.4107 -32.3200 -37.5068
quadrupole: 0.0000 -0.5104 0.0000
quadrupole: 3.0018 1.0925 -4.0943 0.0000 -0.5104 0.0000
hfenergy: -147.7089966 hartree
pointgroup: C01 [X(C2H6Br1N1)]
dipole: -0.9853218 0.0002135 0.5064555 debye
dipolederiv: -0.703145 0.0001042 -0.0182659 0.0001127 -0.1634303 0.0000036 -0.2534789 0.0000478 -0.0955431 0.6636525 -0.0001764 0.1045492 -0.00024 -0.2170751 -0.00002 0.2889693 -0.0000573 -0.3111406 -0.0449349 0.0186397 -0.0179857 -0.1559516 0.1748267 0.0578757 -0.1406255 0.0228692 0.2680976 -0.0450254 -0.0185485 -0.0180032 0.1560374 0.1747736 -0.0578672 -0.1407914 -0.0228181 0.2681023 0.1036433 0.0300124 0.0070233 0.0457195 0.0111443 0.0152328 0.0948534 -0.1056627 -0.2197365 -0.1199604 0.0275721 -0.0686692 0.0459229 0.0717769 -0.0283896 -0.0264538 -0.0494468 0.0861604 0.080981 -0.1052601 0.036509 -0.0316383 -0.0674683 0.0461188 0.0544712 0.0541974 0.0688206 -0.1198683 -0.0274831 -0.068662 -0.0458086 0.071807 0.028419 -0.0264174 0.049462 0.0861594 0.1036144 -0.0300536 0.0070154 -0.0457501 0.011177 -0.015236 0.0950515 0.1056297 -0.2197404 0.0810428 0.1051932 0.0364891 0.0315961 -0.0675317 -0.046137 0.0544216 -0.0542212 0.0688203 unknown
polarizability: 68.8541097|-0.0054847|38.7269226|3.1150661|-0.0008088|28.722687 unknown
InChI: InChI=1S/C2H6BrN/c1-4(2)3/h1-2H3
charge 0 multiplicity 1
10 atoms
Br 1.785511 -0.000411 0.09502
N  -0.194528 0.000012 -0.436901
C  -0.803415 1.234749 0.136009
C  -0.803953 -1.234458 0.136014
H  -0.803934 1.282158 1.247103
H  -1.852534 1.251082 -0.220419
H  -0.283827 2.117179 -0.267313
H  -1.853079 -1.25033 -0.220412
H  -0.804487 -1.281865 1.247108
H  -0.284752 -2.117115 -0.267309
