program: Orca
programVersion: 5.0.2
elementType: Br Cl S P O O O C C C C C C C C C C C H H H H H H H H H H H H H H H
charge: 0
multiplicity: 1
keywords: wb97x-d3
keywords: def2-TZVPP
keywords: def2/J RIJCOSX
keywords: DEFGRID2
keywords: scfconv7
keywords: smallprint printgap noloewdin
keywords: NOSOSCF
formula: C11H15BrClO3PS
InChI: InChI=1/C11H15BrClO3PS/c1-3-7-18-17(14,15-4-2)16-11-6-5-9(12)8-10(11)13/h5-6,8H,3-4,7H2,1-2H3
33 atoms
Br 4.682869 -0.448367 -0.696622
Cl 0.37279 -0.1240 2.727622
S  -3.227714 -0.685162 0.835128
P  -2.296358 0.79725 -0.272692
O  -0.953818 1.234521 0.535412
O  -3.091756 2.122138 0.081669
O  -2.072777 0.448859 -1.692037
C  -3.302239 -2.096108 -0.341191
C  -2.280787 -3.180861 -0.051181
C  -0.835375 -2.723958 -0.12878
C  0.306245 0.835793 0.211704
C  -4.509465 2.293717 -0.114316
C  1.065872 0.191929 1.182828
C  0.872594 1.112968 -1.022801
C  -4.960135 2.068566 -1.537965
C  2.371937 -0.191755 0.9250
C  2.175437 0.732517 -1.296735
C  2.912027 0.07651 -0.323375
H  -3.202366 -1.707515 -1.353143
H  -4.315941 -2.483738 -0.241203
H  -2.480251 -3.623194 0.927554
H  -2.459561 -3.972214 -0.785426
H  -0.598458 -2.028777 0.67598
H  -0.157121 -3.571836 -0.028294
H  -0.613728 -2.23358 -1.078364
H  -5.046032 1.638707 0.574991
H  -4.699382 3.321631 0.189196
H  0.306165 1.646674 -1.773015
H  -4.906906 1.021133 -1.834719
H  -6.002314 2.376725 -1.621586
H  -4.380451 2.662837 -2.24424
H  2.942925 -0.693749 1.694601
H  2.598305 0.957439 -2.266234
elementType: Br Cl S P O C H
totalener: -4428.06373907 hartree
nucrepener: 2261.82503399 hartree
electener: -6689.88877306 hartree
twoeener: 3946.43674962 hartree
cpcmener: -0.01889961 hartree
kineticenergy: 4419.41489058 hartree
xcener: -190.172236388169 hartree
chargesum: -0.0000000
charge: -0.030768 -0.067782 -0.178736 0.835388 -0.345229 -0.340380 -0.593276 -0.097154 -0.083681 -0.257927 0.233506 0.012657 -0.037913 -0.167692 -0.241206 -0.030158 -0.078183 -0.081223 0.119636 0.128334 0.070920 0.076138 0.057330 0.101701 0.080583 0.102288 0.110751 0.145755 0.085057 0.098967 0.095386 0.128472 0.148439
qa: -0.0308 -0.0678 -0.1787 0.8354 -0.3452 -0.3404 -0.5933 -0.0972 -0.0837 -0.2579 0.2335 0.0127 -0.0379 -0.1677 -0.2412 -0.0302 -0.0782 -0.0812 0.1196 0.1283 0.0709 0.0761 0.0573 0.1017 0.0806 0.1023 0.1108 0.1458 0.0851 0.0990 0.0954 0.1285 0.1484
va: 1.2219 1.2426 2.2936 5.4792 2.1351 2.1436 1.9863 3.8639 3.8913 3.9364 3.8045 3.8800 3.9590 4.0031 3.8927 3.8685 3.8758 4.0047 1.0320 1.0061 1.0101 1.0100 1.0164 1.0089 1.0071 0.9999 0.9905 1.0163 1.0094 1.0083 1.0069 1.0094 0.9939
dispcorr: -0.018486477 hartree
energy: -4428.082225543759
dipole: -72.95045 71.40657 -1.54388 -2.62431 2.29630 -0.32800 -5.60692 5.44574 -0.16118
magnitude: 1.58655 au
magnitude: 4.03269 debye
