program: Orca
programVersion: 5.0.2
elementType: Br Cl S P O O O C C C C C C C C C C C H H H H H H H H H H H H H H H
charge: 0
multiplicity: 1
keywords: wb97x-d3
keywords: def2-TZVPP
keywords: def2/J RIJCOSX
keywords: DEFGRID2
keywords: scfconv7
keywords: smallprint printgap noloewdin
keywords: NOSOSCF
formula: C11H15BrClO3PS
InChI: InChI=1/C11H15BrClO3PS/c1-3-7-18-17(14,15-4-2)16-11-6-5-9(12)8-10(11)13/h5-6,8H,3-4,7H2,1-2H3
33 atoms
Br 4.498221 -0.739388 -0.212209
Cl 0.276637 2.77103 -0.603336
S  -3.057268 -1.433047 0.979323
P  -2.395359 0.366079 0.204806
O  -1.139368 0.853596 1.135251
O  -3.513511 1.342647 0.749194
O  -2.064857 0.333606 -1.235293
C  -2.759395 -2.558317 -0.43653
C  -1.318551 -3.010228 -0.575793
C  -1.152152 -3.951447 -1.759906
C  0.136566 0.484831 0.824098
C  -3.44935 2.786155 0.631159
C  0.917941 1.29399 0.006389
C  0.675186 -0.677111 1.35078
C  -3.779309 3.259417 -0.762259
C  2.221635 0.93912 -0.299842
C  1.976233 -1.047215 1.053033
C  2.734779 -0.23886 0.220795
H  -3.131872 -2.084746 -1.3437
H  -3.412761 -3.407046 -0.225707
H  -0.667379 -2.14404 -0.707074
H  -1.003035 -3.506306 0.344748
H  -1.790266 -4.83226 -1.668475
H  -1.402037 -3.45487 -2.699085
H  -0.121235 -4.298674 -1.835782
H  -4.184865 3.148559 1.346997
H  -2.470522 3.143393 0.954275
H  0.073317 -1.296206 2.003127
H  -4.739589 2.868242 -1.098816
H  -3.847549 4.34783 -0.754854
H  -3.015464 2.981615 -1.487357
H  2.814502 1.580061 -0.938292
H  2.37648 -1.960868 1.470615
elementType: Br Cl S P O C H
totalener: -4428.06633595 hartree
nucrepener: 2267.46343782 hartree
electener: -6695.52977377 hartree
twoeener: 3951.85702284 hartree
cpcmener: -0.01981352 hartree
kineticenergy: 4419.42150545 hartree
xcener: -190.168346926204 hartree
chargesum: 0.0000000
charge: -0.028514 -0.063090 -0.169394 0.808487 -0.362239 -0.342729 -0.589566 -0.069762 -0.101542 -0.263805 0.269369 0.021919 0.011073 -0.213563 -0.235120 -0.070112 -0.073973 -0.062482 0.110824 0.130850 0.055997 0.071498 0.084615 0.086467 0.092737 0.111370 0.098961 0.148739 0.093327 0.096909 0.075551 0.129068 0.148131
qa: -0.0285 -0.0631 -0.1694 0.8085 -0.3622 -0.3427 -0.5896 -0.0698 -0.1015 -0.2638 0.2694 0.0219 0.0111 -0.2136 -0.2351 -0.0701 -0.0740 -0.0625 0.1108 0.1308 0.0560 0.0715 0.0846 0.0865 0.0927 0.1114 0.0990 0.1487 0.0933 0.0969 0.0756 0.1291 0.1481
va: 1.2236 1.2488 2.2963 5.4848 2.0774 2.1468 1.9909 3.8326 3.9063 3.9577 3.7174 3.8666 4.0292 3.9988 3.9016 3.9138 3.8672 4.0014 1.0279 1.0051 1.0182 1.0100 1.0014 1.0010 1.0037 0.9920 1.0080 1.0057 1.0055 1.0072 1.0219 1.0089 0.9932
dispcorr: -0.018258888 hartree
energy: -4428.084594842383
dipole: -63.14615 62.79847 -0.34768 -5.48964 5.04526 -0.44438 -3.69250 4.46691 0.77440
magnitude: 0.95815 au
magnitude: 2.43543 debye
