program: Orca
programVersion: 5.0.2
elementType: Br Cl S P O O O C C C C C C C C C C C H H H H H H H H H H H H H H H
charge: 0
multiplicity: 1
keywords: wb97x-d3
keywords: def2-TZVPP
keywords: def2/J RIJCOSX
keywords: DEFGRID2
keywords: scfconv7
keywords: smallprint printgap noloewdin
keywords: NOSOSCF
formula: C11H15BrClO3PS
InChI: InChI=1/C11H15BrClO3PS/c1-3-7-18-17(14,15-4-2)16-11-6-5-9(12)8-10(11)13/h5-6,8H,3-4,7H2,1-2H3
33 atoms
Br 4.819831 0.122917 -0.308517
Cl 0.378273 3.138398 0.921832
S  -2.57491 -1.714942 1.223736
P  -2.299922 -0.108907 -0.039596
O  -1.082784 0.662744 0.718829
O  -3.522694 0.84505 0.287314
O  -2.051401 -0.39732 -1.467906
C  -3.64494 -2.780654 0.176213
C  -2.854965 -3.703085 -0.732997
C  -3.779457 -4.624884 -1.514577
C  0.239959 0.488182 0.44149
C  -3.994398 1.83508 -0.661568
C  1.061338 1.608558 0.524435
C  0.800218 -0.73895 0.121337
C  -3.045205 2.996005 -0.818417
C  2.425646 1.509623 0.304574
C  2.162005 -0.8509 -0.106329
C  2.965526 0.273504 -0.01256
H  -4.343748 -2.153997 -0.380004
H  -4.236876 -3.350337 0.8944
H  -2.249702 -3.112335 -1.421942
H  -2.161415 -4.296132 -0.132704
H  -4.375133 -5.252658 -0.849517
H  -4.469001 -4.061302 -2.145493
H  -3.206398 -5.286555 -2.164921
H  -4.191718 1.350998 -1.619121
H  -4.947516 2.165196 -0.252543
H  0.19094 -1.63146 0.067769
H  -3.514375 3.742701 -1.460581
H  -2.826261 3.468593 0.138408
H  -2.107388 2.704314 -1.291378
H  3.04191 2.395596 0.379361
H  2.574518 -1.820304 -0.350046
elementType: Br Cl S P O C H
totalener: -4428.06590631 hartree
nucrepener: 2206.90681881 hartree
electener: -6634.97272512 hartree
twoeener: 3891.21701736 hartree
cpcmener: -0.02006598 hartree
kineticenergy: 4419.41118636 hartree
xcener: -190.166532010329 hartree
chargesum: 0.0000000
charge: -0.030236 -0.065520 -0.169640 0.823358 -0.338652 -0.347800 -0.594383 -0.082655 -0.094364 -0.266376 0.227912 0.039840 0.011851 -0.131377 -0.252579 -0.068928 -0.128724 -0.055109 0.116973 0.128623 0.067531 0.063545 0.083170 0.084817 0.093352 0.101170 0.108162 0.127573 0.100870 0.088047 0.083698 0.128662 0.147190
qa: -0.0302 -0.0655 -0.1696 0.8234 -0.3387 -0.3478 -0.5944 -0.0827 -0.0944 -0.2664 0.2279 0.0398 0.0119 -0.1314 -0.2526 -0.0689 -0.1287 -0.0551 0.1170 0.1286 0.0675 0.0635 0.0832 0.0848 0.0934 0.1012 0.1082 0.1276 0.1009 0.0880 0.0837 0.1287 0.1472
va: 1.2223 1.2461 2.2857 5.4716 2.1351 2.1174 1.9763 3.8550 3.8961 3.9557 3.8312 3.8518 3.9655 3.9679 3.9079 3.9155 3.9624 3.9932 1.0188 1.0035 1.0253 1.0123 1.0009 1.0012 1.0038 1.0018 0.9908 1.0172 1.0106 1.0068 1.0166 1.0103 0.9962
dispcorr: -0.016714188 hartree
energy: -4428.082620494953
dipole: -77.83668 76.46223 -1.37446 -19.51130 18.89531 -0.61599 -8.31748 8.33928 0.02179
magnitude: 1.50634 au
magnitude: 3.82880 debye
