program: Gaussian 09
title: 000066286
version: EM64L-G09RevD.01
frameworkgroup: C1[X(C9H10O)]
method: RPBEPBE
basis: SDD
operation: Freq
keyword: #pfreq=noraman
keyword: PBEPBE/SDD
title: #p freq=noraman PBEPBE/SDD
converged: YES YES NO NO
title: Mulliken charges:
elementType: O C C C C C C C C C H H H H H H H H H H
charge: -0.183084 0.399888 0.315104 -0.640457 -0.411765 -0.403251 -0.828567 -0.238868 -0.232692 -0.042526 0.239124 0.246576 0.225806 0.229444 0.210166 0.266132 0.227395 0.227184 0.226564 0.167829
chargesum: 0.00000
title: Mulliken charges with hydrogens summed into heavy atoms:
elementType: O C C C C C C C C C
charge: -0.183084 0.399888 0.315104 -0.154758 -0.185959 -0.173808 -0.124874 -0.011685 -0.006128 0.125303
polarizability: 1.16233925e+02 -1.72695514e+00 1.00865554e+02 1.25595831e+01 4.75809479e+00 6.30747637e+01
1716.lowfreq: -10.7589 -8.2849 0.0004 0.0008 0.0008 12.0507 53.6183 99.4093 113.9711
frequency: 53.4955 99.4000 113.9643 151.8735 190.7460 268.3236 296.0094 386.2412 440.4568 474.5886 505.5883 561.5631 665.0749 710.1587 717.7727 745.4914 788.8728 829.3889 872.4522 930.8365 946.5195 986.2884 986.4176 988.6797 1045.9647 1051.7432 1114.6804 1173.9845 1179.6694 1193.0148 1232.1939 1279.9246 1306.6461 1377.1885 1384.9546 1394.3496 1424.0697 1442.1821 1473.3438 1481.6085 1490.1383 1590.4815 1616.5874 1654.7092 2844.3395 2945.5675 2972.6581 3004.5940 3052.5088 3084.3499 3112.8743 3120.2473 3138.3864 3160.4159
redmass: 4.6854 5.0053 2.0220 1.5857 2.0121 3.8985 2.1026 2.4349 2.9410 4.8498 3.3512 5.1461 2.7610 2.0934 3.1685 1.3489 3.1517 3.4132 1.3693 2.4010 1.5170 1.3771 1.5983 1.6796 1.5927 2.0410 1.8495 1.0819 1.2577 2.0117 2.0915 1.6278 1.5547 5.0094 1.2376 1.2646 1.3102 1.7565 1.0594 1.3871 1.8151 6.5155 6.3544 7.5271 1.0840 1.0655 1.0381 1.0920 1.0962 1.0985 1.0871 1.0884 1.0931 1.1008
irintensity: 3.3779 5.8096 4.1162 2.4206 2.2246 3.3417 0.9517 1.2455 5.7563 11.3349 0.2764 4.8505 7.1876 3.1673 0.3511 70.7369 6.3853 6.4319 0.5053 14.4427 0.8452 0.1831 0.9477 1.4108 9.0827 10.5331 8.4180 0.6007 3.0875 0.3493 1.9868 24.6506 19.4126 2.3464 12.4835 16.3105 14.4154 11.5110 24.9134 17.4826 20.6151 1.1589 2.6095 101.8042 184.9646 44.8843 30.9501 12.4734 15.6840 18.8095 14.2599 4.0736 32.9998 28.2986
temp: 298.150 k
press: 1.00000 atm
elementType: 8 6 6 6 6 6 6 6 6 6 1 1 1 1 1 1 1 1 1 1
symmnumber: 1
zpe: 424994.8 jmol-1
zpe.correction: 0.161872 hartree
zpe.thermalcorrener: 0.171416 hartree
zpe.thermalcorrenthalpy: 0.172360 hartree
zpe.thermalcorrgfe: 0.126756 hartree
zpe.sumelectzpe: -423.438649 hartree
zpe.sumelectthermal: -423.429105 hartree
zpe.sumelectthermalent: -423.428161 hartree
zpe.sumelectthermalfe: -423.473765 hartree
dipole: -0.1249 -0.6390 -2.6518
dipole: 2.7306
quadrupole: -54.9386 -52.4705 -65.1172
quadrupole: 2.4179 9.0378 0.6721
quadrupole: 2.5702 5.0383 -7.6085 2.4179 9.0378 0.6721
hfenergy: -423.6005212 hartree
pointgroup: C01 [X(C9H10O1)]
dipole: 0.0370913 0.050085 -1.072479 debye
dipolederiv: -0.4924452 -0.0119782 -0.0141888 0.0052219 -0.300198 0.0938854 -0.2052866 0.0856199 -0.7988773 0.2082227 0.0158607 -0.0543239 0.0876248 -0.1155074 0.0073351 -0.1293731 0.0093426 -0.08252 0.040565 -0.2046059 0.0185899 -0.1576544 0.2366929 0.0054047 0.0770566 -0.0080536 -0.0251055 -0.2330432 0.0141067 -0.1965757 0.0328375 0.1341854 0.0152184 -0.3480615 0.0378022 -0.2225567 -0.0812221 0.0408424 -0.0630802 0.0258439 0.0467686 -0.0516451 -0.0247612 -0.0444185 -0.1244797 -0.0869747 0.1434291 -0.0608689 0.0696228 -0.012695 -0.0602014 -0.0530384 -0.0958289 -0.1309933 -0.0388576 0.150826 -0.0314307 0.0681508 -0.0652583 0.0038728 -0.0406646 0.0216031 0.0501832 -0.0569862 -0.0788047 -0.0246745 -0.0767185 0.0334588 -0.0121288 -0.0212271 -0.0106381 -0.15043 0.0644004 -0.0057793 -0.0838381 0.0056868 -0.0234205 -0.0273549 -0.0835275 -0.0229358 -0.1171224 1.0058404 0.0558481 0.129969 -0.0037045 0.1037596 -0.1668928 0.2938694 -0.1499797 0.9757197 -0.0113131 0.0374904 0.013558 0.0765051 0.0146477 -0.1296106 0.0796624 -0.0716314 0.048941 0.0157608 -0.0199612 -0.0120259 -0.0774343 -0.0480079 0.1199353 0.0522451 0.0524129 0.0863653 0.0412757 -0.0959671 0.0654799 -0.0695074 -0.0632132 0.0614437 0.0539123 0.0768602 0.1086288 0.05418 -0.0514373 0.0420481 -0.083487 -0.0814296 0.0724713 0.0519211 0.065135 0.1194469 0.0378612 0.0589724 0.1019716 0.048241 0.0382407 0.0071241 0.1143368 -0.0777457 -0.0941038 -0.0133753 0.0536175 -0.0904936 0.0318475 0.0711529 -0.0310283 -0.101316 0.0161503 0.0255369 -0.0059993 -0.1650617 0.0418881 -0.0594767 -0.0613277 0.0274019 0.039 0.0520737 0.0995386 0.0236128 0.0995619 0.0238709 0.1112791 -0.0717617 0.0109641 0.0254488 0.0145167 0.1500731 -0.1104476 0.0122995 0.0899442 0.0041533 0.085905 0.0125249 0.0938925 0.0096281 0.1251927 -0.3610548 -0.0492593 0.1041806 -0.0390316 0.0780076 0.0412804 0.125911 0.040087 -0.0434374 unknown
polarizability: 114.3639402|-6.4284901|99.2796916|-14.2841507|-9.4001584|66.5306105 unknown
InChI: InChI=1S/C9H10O/c1-8-4-2-3-5-9(8)6-7-10/h2-5,7H,6H2,1H3
charge 0 multiplicity 1
20 atoms
O  2.552589 -0.118819 1.225373
C  0.150296 0.239728 -0.514983
C  -0.44305 -0.974598 -0.053947
C  1.578658 0.284271 -1.025943
C  -0.607459 1.436948 -0.493276
C  -1.782919 -0.940844 0.408085
C  0.3265 -2.283668 -0.037604
C  -1.939195 1.456845 -0.024335
C  -2.530559 0.25753 0.42901
C  2.694531 0.149974 0.012174
H  1.77495 -0.518526 -1.772089
H  1.772854 1.230279 -1.571939
H  -0.146309 2.367397 -0.848191
H  -2.244169 -1.871358 0.760727
H  0.800727 -2.502975 -1.013901
H  1.130604 -2.254411 0.720652
H  -0.338832 -3.129314 0.205971
H  -2.505862 2.39438 -0.015513
H  -3.563811 0.252956 0.793936
H  3.718857 0.308405 -0.420709
