program: Orca
programVersion: 5.0.2
elementType: Br Cl S P O O O C C C C C C C C C C C H H H H H H H H H H H H H H H
charge: 0
multiplicity: 1
keywords: wb97x-d3
keywords: def2-TZVPP
keywords: def2/J RIJCOSX
keywords: DEFGRID2
keywords: scfconv7
keywords: smallprint printgap noloewdin
keywords: NOSOSCF
formula: C11H15BrClO3PS
InChI: InChI=1/C11H15BrClO3PS/c1-3-7-18-17(14,15-4-2)16-11-6-5-9(12)8-10(11)13/h5-6,8H,3-4,7H2,1-2H3
33 atoms
Br 4.353217 -1.123402 0.193807
Cl -0.01351 1.63064 2.112761
S  -2.50609 -0.473941 0.689403
P  -2.270662 0.69041 -1.009845
O  -0.947894 1.582473 -0.657356
O  -3.370225 1.825132 -1.018002
O  -2.21058 -0.044337 -2.288938
C  -2.909146 -2.131123 -0.000204
C  -1.816376 -3.143181 0.294918
C  -0.471924 -2.818985 -0.332899
C  0.260841 0.968974 -0.48464
C  -3.732476 2.614197 0.138299
C  0.81806 0.914464 0.78765
C  0.946961 0.423921 -1.557383
C  -5.125166 2.260992 0.59032
C  2.041243 0.298545 0.997703
C  2.169485 -0.196928 -1.363223
C  2.699852 -0.264922 -0.084329
H  -3.088715 -2.036962 -1.069631
H  -3.848715 -2.422286 0.468097
H  -1.707284 -3.264415 1.375435
H  -2.179192 -4.10417 -0.081872
H  0.229978 -3.640059 -0.18285
H  -0.56049 -2.651699 -1.407637
H  -0.026281 -1.928165 0.110566
H  -3.012002 2.479039 0.948439
H  -3.669839 3.654981 -0.177468
H  0.530197 0.48913 -2.553415
H  -5.408445 2.915028 1.415836
H  -5.852478 2.39955 -0.209845
H  -5.18483 1.231374 0.942967
H  2.456189 0.261664 1.995978
H  2.688323 -0.620483 -2.212176
elementType: Br Cl S P O C H
totalener: -4428.06488542 hartree
nucrepener: 2302.67578813 hartree
electener: -6730.74067356 hartree
twoeener: 3986.73221486 hartree
cpcmener: -0.01985747 hartree
kineticenergy: 4419.42355859 hartree
xcener: -190.172453026043 hartree
chargesum: -0.0000000
charge: -0.026938 -0.060988 -0.199477 0.826324 -0.347096 -0.346026 -0.595828 -0.083644 -0.080683 -0.250368 0.219755 0.040622 0.007159 -0.167831 -0.227211 -0.054230 -0.094133 -0.061240 0.115041 0.127671 0.070057 0.075996 0.100116 0.085545 0.045725 0.082572 0.109657 0.150569 0.092729 0.092851 0.075985 0.129520 0.147797
qa: -0.0269 -0.0610 -0.1995 0.8263 -0.3471 -0.3460 -0.5958 -0.0836 -0.0807 -0.2504 0.2198 0.0406 0.0072 -0.1678 -0.2272 -0.0542 -0.0941 -0.0612 0.1150 0.1277 0.0701 0.0760 0.1001 0.0855 0.0457 0.0826 0.1097 0.1506 0.0927 0.0929 0.0760 0.1295 0.1478
va: 1.2235 1.2500 2.2849 5.4983 2.0952 2.1304 2.0168 3.8675 3.8906 3.9377 3.7912 3.8710 3.9860 3.9708 3.9279 3.8918 3.8633 3.9790 1.0340 1.0078 1.0108 1.0107 1.0090 1.0049 1.0133 1.0002 0.9963 1.0102 1.0084 1.0038 1.0150 1.0095 0.9941
dispcorr: -0.019302993 hartree
energy: -4428.084188413448
dipole: -65.27289 64.67568 -0.59721 0.84472 -1.01811 -0.17339 -4.44385 5.66281 1.21895
magnitude: 1.36842 au
magnitude: 3.47825 debye
