program: Orca
programVersion: 5.0.2
elementType: Br Cl S P O O O C C C C C C C C C C C H H H H H H H H H H H H H H H
charge: 0
multiplicity: 1
keywords: wb97x-d3
keywords: def2-TZVPP
keywords: def2/J RIJCOSX
keywords: DEFGRID2
keywords: scfconv7
keywords: smallprint printgap noloewdin
keywords: NOSOSCF
formula: C11H15BrClO3PS
InChI: InChI=1/C11H15BrClO3PS/c1-3-7-18-17(14,15-4-2)16-11-6-5-9(12)8-10(11)13/h5-6,8H,3-4,7H2,1-2H3
33 atoms
Br 4.359611 -1.329791 -0.044712
Cl 0.68797 2.51235 -1.484703
S  -2.685418 -0.908552 0.866389
P  -2.287725 0.990859 0.129399
O  -0.887641 1.482443 0.8029
O  -3.198773 1.973044 0.977968
O  -2.347003 1.07097 -1.344882
C  -2.590396 -1.914874 -0.666069
C  -1.181592 -2.270698 -1.100954
C  -0.473471 -3.217739 -0.148496
C  0.295175 0.833142 0.594435
C  -4.474092 2.453329 0.494088
C  1.131737 1.209719 -0.451342
C  0.6988 -0.164136 1.466495
C  -5.564039 1.415851 0.589274
C  2.3455 0.568965 -0.648012
C  1.910913 -0.808787 1.286425
C  2.718185 -0.44519 0.220312
H  -3.141601 -1.394337 -1.446301
H  -3.158719 -2.813602 -0.417379
H  -1.263274 -2.739917 -2.085914
H  -0.594407 -1.361251 -1.249753
H  -0.400928 -2.804269 0.858183
H  -1.002508 -4.170067 -0.076851
H  0.540851 -3.428583 -0.488972
H  -4.698921 3.309193 1.128532
H  -4.362477 2.817758 -0.52837
H  0.065722 -0.4335 2.300773
H  -6.513553 1.885705 0.328641
H  -5.409278 0.585431 -0.09999
H  -5.655652 1.01873 1.600195
H  2.979513 0.871245 -1.470648
H  2.204695 -1.58607 1.978193
elementType: Br Cl S P O C H
totalener: -4428.06465983 hartree
nucrepener: 2288.03138462 hartree
electener: -6716.09604445 hartree
twoeener: 3972.40186358 hartree
cpcmener: -0.02081537 hartree
kineticenergy: 4419.41427933 hartree
xcener: -190.169674997160 hartree
chargesum: 0.0000000
charge: -0.027584 -0.058120 -0.183502 0.812988 -0.347271 -0.352068 -0.589481 -0.083769 -0.092901 -0.272733 0.209224 0.041234 0.026876 -0.183730 -0.255005 -0.073975 -0.104572 -0.043152 0.124343 0.124307 0.087006 0.055800 0.072802 0.099208 0.092710 0.108028 0.101478 0.156094 0.101292 0.087044 0.090200 0.128214 0.149015
qa: -0.0276 -0.0581 -0.1835 0.8130 -0.3473 -0.3521 -0.5895 -0.0838 -0.0929 -0.2727 0.2092 0.0412 0.0269 -0.1837 -0.2550 -0.0740 -0.1046 -0.0432 0.1243 0.1243 0.0870 0.0558 0.0728 0.0992 0.0927 0.1080 0.1015 0.1561 0.1013 0.0870 0.0902 0.1282 0.1490
va: 1.2232 1.2539 2.2741 5.4904 2.1244 2.1228 1.9984 3.8507 3.8943 3.9349 3.7934 3.8552 3.9820 3.9478 3.9052 3.9336 3.8402 3.9586 1.0281 1.0042 1.0107 1.0192 1.0049 1.0048 1.0034 0.9903 1.0043 0.9993 1.0100 1.0075 1.0046 1.0115 0.9941
dispcorr: -0.019339847 hartree
energy: -4428.083999673863
dipole: -68.04314 66.98869 -1.05445 -1.55350 0.45360 -1.09990 2.56617 -1.78500 0.78117
magnitude: 1.71227 au
magnitude: 4.35225 debye
