program: Orca
programVersion: 5.0.2
elementType: Br Cl S P O O O C C C C C C C C C C C H H H H H H H H H H H H H H H
charge: 0
multiplicity: 1
keywords: wb97x-d3
keywords: def2-TZVPP
keywords: def2/J RIJCOSX
keywords: DEFGRID2
keywords: scfconv7
keywords: smallprint printgap noloewdin
keywords: NOSOSCF
formula: C11H15BrClO3PS
InChI: InChI=1/C11H15BrClO3PS/c1-3-7-18-17(14,15-4-2)16-11-6-5-9(12)8-10(11)13/h5-6,8H,3-4,7H2,1-2H3
33 atoms
Br 4.554138 0.575679 1.308712
Cl 0.27288 2.362911 -1.654636
S  -2.336027 -1.679918 0.815564
P  -2.177825 -0.16252 -0.575178
O  -0.756983 -0.369992 -1.344681
O  -1.881851 1.074425 0.370221
O  -3.252829 -0.061848 -1.581879
C  -2.836415 -3.077701 -0.263221
C  -4.341109 -3.194524 -0.413424
C  -4.717609 -4.412262 -1.242422
C  0.445178 -0.162931 -0.730809
C  -2.847317 2.126522 0.609206
C  1.047812 1.088397 -0.799017
C  1.089589 -1.1965 -0.074464
C  -3.980978 1.672454 1.493071
C  2.276509 1.314477 -0.201007
C  2.318665 -0.986408 0.529114
C  2.896543 0.271295 0.468731
H  -2.423886 -3.960094 0.227796
H  -2.333703 -2.991867 -1.227654
H  -4.798445 -3.265869 0.575896
H  -4.735872 -2.290515 -0.878389
H  -4.30031 -4.356059 -2.249318
H  -4.358407 -5.335199 -0.784537
H  -5.800272 -4.494268 -1.339646
H  -2.273537 2.918166 1.086438
H  -3.212214 2.505961 -0.345487
H  0.634412 -2.176666 -0.040377
H  -3.618449 1.279708 2.442794
H  -4.620589 2.528861 1.70994
H  -4.600823 0.914447 1.01348
H  2.727515 2.295319 -0.262566
H  2.804582 -1.806087 1.039107
elementType: Br Cl S P O C H
totalener: -4428.06630240 hartree
nucrepener: 2236.27328337 hartree
electener: -6664.33958577 hartree
twoeener: 3920.44990463 hartree
cpcmener: -0.02198353 hartree
kineticenergy: 4419.44579647 hartree
xcener: -190.173802100183 hartree
chargesum: -0.0000000
charge: -0.028003 -0.064872 -0.171844 0.798191 -0.353921 -0.341750 -0.593056 -0.080066 -0.084670 -0.270165 0.232321 0.043593 0.001456 -0.178347 -0.253671 -0.058891 -0.090726 -0.066353 0.127470 0.115434 0.063640 0.066173 0.084947 0.082630 0.093397 0.106364 0.103210 0.158619 0.091872 0.100550 0.088338 0.130414 0.147719
qa: -0.0280 -0.0649 -0.1718 0.7982 -0.3539 -0.3418 -0.5931 -0.0801 -0.0847 -0.2702 0.2323 0.0436 0.0015 -0.1783 -0.2537 -0.0589 -0.0907 -0.0664 0.1275 0.1154 0.0636 0.0662 0.0849 0.0826 0.0934 0.1064 0.1032 0.1586 0.0919 0.1005 0.0883 0.1304 0.1477
va: 1.2238 1.2469 2.2859 5.5056 2.1117 2.0930 2.0147 3.8328 3.9093 3.9557 3.8227 3.8353 3.9943 4.0280 3.9293 3.9033 3.8980 3.9998 1.0049 1.0187 1.0126 1.0262 1.0010 1.0009 1.0042 0.9898 1.0027 0.9950 1.0026 1.0108 1.0112 1.0087 0.9949
dispcorr: -0.016969835 hartree
energy: -4428.083272234627
dipole: -79.04966 78.94862 -0.10105 -25.31040 24.48034 -0.83006 -8.61719 9.91464 1.29745
magnitude: 1.54356 au
magnitude: 3.92342 debye
