program: Orca
programVersion: 5.0.2
elementType: Br Cl S P O O O C C C C C C C C C C C H H H H H H H H H H H H H H H
charge: 0
multiplicity: 1
keywords: wb97x-d3
keywords: def2-TZVPP
keywords: def2/J RIJCOSX
keywords: DEFGRID2
keywords: scfconv7
keywords: smallprint printgap noloewdin
keywords: NOSOSCF
formula: C11H15BrClO3PS
InChI: InChI=1/C11H15BrClO3PS/c1-3-7-18-17(14,15-4-2)16-11-6-5-9(12)8-10(11)13/h5-6,8H,3-4,7H2,1-2H3
33 atoms
Br 4.531591 0.600962 1.344532
Cl 0.273584 2.336403 -1.682671
S  -2.354094 -1.674911 0.826545
P  -2.182074 -0.164815 -0.569986
O  -0.759282 -0.389362 -1.332929
O  -1.880265 1.070861 0.374636
O  -3.252623 -0.057894 -1.580448
C  -2.797895 -3.087874 -0.257959
C  -4.29474 -3.228057 -0.458627
C  -4.625079 -4.457147 -1.29077
C  0.43935 -0.172837 -0.715154
C  -2.8158 2.156633 0.577331
C  1.042611 1.076972 -0.799916
C  1.078108 -1.194501 -0.035291
C  -3.978119 1.750746 1.44743
C  2.266114 1.313798 -0.195649
C  2.302111 -0.973739 0.574616
C  2.880855 0.282318 0.496556
H  -2.389067 -3.960496 0.253246
H  -2.263649 -3.001022 -1.205325
H  -4.784609 -3.299002 0.515008
H  -4.686522 -2.333413 -0.943804
H  -4.268487 -5.371536 -0.814023
H  -5.702497 -4.555667 -1.424406
H  -4.174394 -4.40202 -2.283253
H  -2.226088 2.937968 1.052255
H  -3.152514 2.531673 -0.389451
H  0.622295 -2.173677 0.013026
H  -3.643979 1.358979 2.408043
H  -4.593968 2.629431 1.64279
H  -4.61281 1.006176 0.966158
H  2.717159 2.293627 -0.269702
H  2.783425 -1.783842 1.103689
elementType: Br Cl S P O C H
totalener: -4428.06637629 hartree
nucrepener: 2237.35602481 hartree
electener: -6665.42240110 hartree
twoeener: 3921.51276987 hartree
cpcmener: -0.02203810 hartree
kineticenergy: 4419.44714298 hartree
xcener: -190.173898262776 hartree
chargesum: -0.0000000
charge: -0.027931 -0.065240 -0.171443 0.798189 -0.354556 -0.342381 -0.592580 -0.081560 -0.084247 -0.270273 0.232156 0.043557 0.002168 -0.178213 -0.253807 -0.059038 -0.090999 -0.066296 0.127921 0.115417 0.063333 0.066296 0.082701 0.093314 0.084995 0.106756 0.103288 0.159118 0.091651 0.100336 0.089111 0.130541 0.147716
qa: -0.0279 -0.0652 -0.1714 0.7982 -0.3546 -0.3424 -0.5926 -0.0816 -0.0842 -0.2703 0.2322 0.0436 0.0022 -0.1782 -0.2538 -0.0590 -0.0910 -0.0663 0.1279 0.1154 0.0633 0.0663 0.0827 0.0933 0.0850 0.1068 0.1033 0.1591 0.0917 0.1003 0.0891 0.1305 0.1477
va: 1.2239 1.2466 2.2860 5.5044 2.1090 2.0918 2.0158 3.8347 3.9095 3.9554 3.8233 3.8336 3.9941 4.0284 3.9307 3.9043 3.8986 4.0001 1.0045 1.0182 1.0128 1.0266 1.0008 1.0042 1.0009 0.9895 1.0026 0.9944 1.0027 1.0107 1.0116 1.0086 0.9950
dispcorr: -0.016997704 hartree
energy: -4428.083373993437
dipole: -78.33434 78.27396 -0.06039 -25.41215 24.60204 -0.81011 -9.25203 10.53171 1.27968
magnitude: 1.51576 au
magnitude: 3.85275 debye
