program: Orca
programVersion: 5.0.2
elementType: Br Cl S P O O O C C C C C C C C C C C H H H H H H H H H H H H H H H
charge: 0
multiplicity: 1
keywords: wb97x-d3
keywords: def2-TZVPP
keywords: def2/J RIJCOSX
keywords: DEFGRID2
keywords: scfconv7
keywords: smallprint printgap noloewdin
keywords: NOSOSCF
formula: C11H15BrClO3PS
InChI: InChI=1/C11H15BrClO3PS/c1-3-7-18-17(14,15-4-2)16-11-6-5-9(12)8-10(11)13/h5-6,8H,3-4,7H2,1-2H3
33 atoms
Br 4.975935 0.464375 0.031953
Cl -0.009618 2.715642 -0.603063
S  -2.083802 -2.275129 0.480894
P  -2.023538 -0.324925 -0.186134
O  -0.977623 0.349417 0.869944
O  -3.394627 0.29743 0.310689
O  -1.666405 -0.13825 -1.607826
C  -2.776254 -3.107494 -1.000664
C  -4.217175 -2.757687 -1.328101
C  -5.195705 -2.986717 -0.189546
C  0.369503 0.350985 0.641701
C  -3.789162 1.655394 -0.01606
C  0.961879 1.414771 -0.029802
C  1.160714 -0.674327 1.130703
C  -3.53795 2.586472 1.142394
C  2.335024 1.45618 -0.214566
C  2.53395 -0.648249 0.953682
C  3.1088 0.416804 0.278052
H  -2.684086 -4.166345 -0.751744
H  -2.112777 -2.914814 -1.842499
H  -4.282616 -1.726371 -1.683423
H  -4.494315 -3.382932 -2.182175
H  -5.124579 -4.005051 0.198422
H  -5.019711 -2.301784 0.640725
H  -6.221759 -2.833723 -0.526194
H  -3.277567 1.992407 -0.919642
H  -4.852385 1.596797 -0.245431
H  0.705604 -1.493371 1.671831
H  -2.476299 2.69721 1.359707
H  -3.928647 3.573935 0.891625
H  -4.046426 2.24786 2.045525
H  2.779069 2.292561 -0.737457
H  3.133281 -1.45826 1.346007
elementType: Br Cl S P O C H
totalener: -4428.06646205 hartree
nucrepener: 2236.00152873 hartree
electener: -6664.06799078 hartree
twoeener: 3920.64006211 hartree
cpcmener: -0.02054512 hartree
kineticenergy: 4419.41139350 hartree
xcener: -190.165660443557 hartree
chargesum: 0.0000000
charge: -0.027840 -0.061419 -0.173001 0.813052 -0.373466 -0.335759 -0.592038 -0.106566 -0.104080 -0.258601 0.241479 0.040924 0.006158 -0.177944 -0.231736 -0.061847 -0.088335 -0.067721 0.127300 0.128123 0.065941 0.084835 0.085965 0.074492 0.094673 0.092882 0.111534 0.157380 0.067766 0.095931 0.092478 0.131180 0.148259
qa: -0.0278 -0.0614 -0.1730 0.8131 -0.3735 -0.3358 -0.5920 -0.1066 -0.1041 -0.2586 0.2415 0.0409 0.0062 -0.1779 -0.2317 -0.0618 -0.0883 -0.0677 0.1273 0.1281 0.0659 0.0848 0.0860 0.0745 0.0947 0.0929 0.1115 0.1574 0.0678 0.0959 0.0925 0.1312 0.1483
va: 1.2236 1.2520 2.2938 5.5100 2.1028 2.0939 2.0010 3.8796 3.8699 3.9337 3.7750 3.8466 4.0388 4.0625 3.9345 3.8960 3.9046 4.0043 1.0015 1.0231 1.0208 1.0077 1.0008 1.0137 1.0052 1.0068 0.9915 0.9947 1.0238 1.0074 1.0057 1.0073 0.9945
dispcorr: -0.017465855 hartree
energy: -4428.083927905584
dipole: -83.86135 82.77576 -1.08559 -17.00823 16.41065 -0.59758 -0.02827 0.64856 0.62029
magnitude: 1.38577 au
magnitude: 3.52235 debye
