program: Gaussian 09
title: 000066283
version: EM64L-G09RevD.01
frameworkgroup: C1[X(C5H16N3OP)]
method: RPBEPBE
basis: SDD
operation: Freq
keyword: #p
keyword: freq=noraman
keyword: PBEPBE/SDD
title: #p freq=noraman PBEPBE/SDD
converged: NO YES NO NO
title: Mulliken charges:
elementType: P O N N N C C C C C H H H H H H H H H H H H H H H H
charge: 1.389596 -0.647907 -0.462791 -0.468783 -0.708565 -0.584849 -0.574859 -0.579864 -0.580340 -0.579926 0.333524 0.217023 0.280090 0.204477 0.235975 0.224151 0.213214 0.214916 0.220459 0.245800 0.206810 0.279268 0.215185 0.251694 0.234183 0.221519
chargesum: 0.00000
title: Mulliken charges with hydrogens summed into heavy atoms:
elementType: P O N N N C C C C C
charge: 1.389596 -0.647907 -0.462791 -0.468783 -0.375041 0.116741 0.098481 0.101312 0.120922 0.127470
polarizability: 1.11107552e+02 1.13123301e+00 9.80952276e+01 -7.89790665e-01 1.38379320e+00 9.34534166e+01
1716.lowfreq: -22.0855 -12.6174 0.0004 0.0016 0.0022 15.3319 36.9491 89.1310 93.4601
frequency: 35.3057 89.0616 93.4261 103.7047 121.6397 130.9553 158.6172 201.8001 207.2655 214.4492 232.4428 247.0036 263.4275 285.8680 309.9134 314.2315 354.5678 398.0186 433.9846 461.8309 560.5679 573.9714 665.6888 771.2307 952.8605 961.1822 1011.2917 1059.4178 1063.4929 1089.6493 1095.9025 1106.8296 1107.6324 1115.3770 1131.2184 1137.0053 1200.6085 1214.2234 1263.7606 1271.6604 1382.3449 1414.9078 1420.5493 1429.2310 1432.4455 1437.8854 1461.3288 1471.9523 1476.6094 1478.6119 1479.0905 1483.5835 1486.5593 1492.6744 1494.8881 1502.0822 2917.9698 2925.1934 2928.8640 2934.4681 2962.2354 2996.5941 3005.8794 3006.8025 3011.6325 3045.0716 3084.6980 3087.8941 3088.6125 3090.8473 3091.2897 3537.1888
redmass: 2.6574 2.6470 1.9801 2.2226 1.6170 1.5981 2.6753 2.9340 1.1081 1.1797 1.4558 1.2616 2.9748 3.4200 3.6037 3.3471 3.5891 3.3584 3.7402 3.6770 2.0776 2.4353 6.5006 2.9177 2.8705 2.9654 9.7805 1.3556 1.3299 1.2188 1.2183 1.6736 2.5453 1.3735 1.3513 1.3446 6.2600 7.0113 2.1143 2.1786 1.2908 1.1251 1.1237 1.1348 1.1389 1.1457 1.0455 1.0465 1.0493 1.0481 1.0475 1.0509 1.0470 1.0433 1.0581 1.0542 1.0447 1.0404 1.0414 1.0397 1.0375 1.0959 1.0912 1.0981 1.0949 1.0988 1.0959 1.0955 1.0966 1.0984 1.0974 1.0752
irintensity: 0.2304 1.7096 2.2433 2.7209 1.6469 1.2338 0.0900 2.2589 0.9920 0.3268 1.3340 0.9805 12.1029 23.6771 11.7637 7.7970 10.9099 18.1869 7.1764 13.8806 85.4366 29.2815 131.1014 138.9240 226.9350 122.3484 104.3966 3.1916 9.5801 0.9546 1.3443 54.4989 41.2236 7.1113 1.3821 0.3095 12.8510 94.6195 7.7440 15.4022 35.9093 0.9787 23.8627 10.5582 0.3119 1.3235 7.9506 4.5033 10.0172 31.3950 5.7112 45.4885 18.7405 14.2652 1.1377 3.4861 41.6037 93.9232 109.6277 189.0249 80.5858 85.0927 76.7372 32.8886 30.7623 36.4461 16.8217 15.8325 12.6813 10.4203 4.1840 15.6521
temp: 298.150 k
press: 1.00000 atm
elementType: 15 8 7 7 7 6 6 6 6 6 1 1 1 1 1 1 1 1 1 1 1 1 1 1 1 1
symmnumber: 1
zpe: 580613.9 jmol-1
zpe.correction: 0.221144 hartree
zpe.thermalcorrener: 0.235708 hartree
zpe.thermalcorrenthalpy: 0.236653 hartree
zpe.thermalcorrgfe: 0.180423 hartree
zpe.sumelectzpe: -779.941058 hartree
zpe.sumelectthermal: -779.926493 hartree
zpe.sumelectthermalent: -779.925549 hartree
zpe.sumelectthermalfe: -779.981779 hartree
dipole: -0.4305 1.0074 4.1374
dipole: 4.2800
quadrupole: -64.3864 -64.4418 -78.6464
quadrupole: -0.2210 1.1042 -1.8073
quadrupole: 4.7718 4.7164 -9.4882 -0.2210 1.1042 -1.8073
hfenergy: -780.1622019 hartree
pointgroup: C01 [X(C5H16N3O1P1)]
dipole: 0.2849276 -0.1074934 -1.656102 debye
dipolederiv: 2.2753852 -0.109338 0.155372 0.053386 2.0124218 -0.1143198 0.2412788 -0.0456276 1.4629262 -0.7584957 0.0355983 0.0042853 -0.0253224 -0.7179036 -0.011098 -0.0292523 -0.0573416 -0.7901784 -1.1029803 -0.1267733 0.0028377 -0.170853 -0.695546 -0.0300675 0.0842454 0.0004535 -0.8026491 -0.8273991 0.1612272 -0.0843787 0.2328867 -0.912934 0.0670676 -0.1823009 0.1085023 -0.9009213 -0.7597698 -0.2825819 0.0134999 -0.2389375 -0.9110112 -0.053829 -0.0151979 -0.1556625 -0.7299873 0.2858065 0.0631535 0.1820431 0.2071745 0.3633628 0.0733252 0.3874185 0.08964 0.1589045 0.1599816 -0.0493237 -0.1265479 -0.0212141 0.2696168 -0.0972471 -0.3525492 -0.1275452 0.3726939 0.170054 0.1514587 -0.0145547 0.1307381 0.1244424 -0.0548614 0.1507602 -0.2033811 0.5181863 0.3179848 -0.0721918 -0.0628919 -0.177762 0.5296462 0.0284623 -0.1914604 0.195617 -0.013619 0.3980109 0.3963673 0.0344329 0.1316955 0.2448312 -0.018585 -0.0068184 -0.0267572 0.2561908 0.0983987 -0.0110874 -0.0691772 0.0448775 0.124679 -0.0187029 -0.0963216 -0.0280847 0.2824814 -0.2253793 0.0649624 -0.1070698 0.088944 0.0010019 -0.008677 -0.0319839 -0.0153357 0.0900459 0.1704948 0.0182699 0.1148346 -0.0021366 0.1097717 0.0096236 0.0311371 -0.0089016 -0.0077145 -0.0023892 -0.0641871 -0.0623083 -0.152357 -0.2254069 -0.0127564 -0.0129042 0.0851785 0.0451387 0.0781711 -0.0753125 -0.1226539 -0.0669412 0.0415521 -0.0768708 -0.0734989 -0.0612604 -0.011966 -0.2053865 0.0968202 0.0884224 0.1005979 0.046124 0.0141493 0.0301023 0.0287627 0.0498191 0.0437445 -0.0017487 0.0543079 -0.0872122 -0.183165 0.1684003 0.0829551 0.0650936 -0.033885 0.0217851 -0.1266555 0.077676 -0.0889697 -0.1084945 0.1762768 -0.0013993 0.0807505 -0.0794867 -0.1916879 0.0190991 -0.1470271 0.0175155 0.0954845 0.0499192 -0.0772509 0.034559 -0.0174028 0.0888831 0.0675449 0.0766337 0.0607146 -0.0310615 -0.1075327 0.0395744 -0.066043 0.0725301 0.0067123 -0.0941785 0.0528034 0.0062881 -0.2472919 0.0203228 0.0374513 0.0984966 0.0665732 0.1550674 -0.0408366 -0.030911 -0.0325169 0.1429823 0.0279614 0.0255934 -0.0426957 -0.0323704 -0.2331404 0.0836449 -0.0303463 0.039297 0.0039674 -0.0271772 -0.0931486 0.0114644 0.0946062 0.0012443 0.07539 -0.0225414 0.1493112 0.03493 0.0377099 -0.0095272 0.0338791 0.0963709 -0.0070265 -0.1213716 0.0192544 -0.1158951 -0.0610761 0.083336 0.0866153 0.1703278 -0.0681484 0.0419302 -0.0579498 0.0040049 -0.0833089 -0.0509231 -0.1248295 -0.023518 -0.1640887 -0.0781382 unknown
polarizability: 109.8840436|-0.247498|97.327213|4.5909564|2.1951496|95.44494 unknown
InChI: InChI=1S/C5H16N3OP/c1-6-10(9,7(2)3)8(4)5/h6H,1-5H3
charge 0 multiplicity 1
26 atoms
P  -0.116063 -0.234535 0.610551
O  -0.406623 -0.049336 2.17801
N  1.606799 -0.021277 0.299532
N  -1.219365 0.775922 -0.308324
N  -0.329642 -1.762263 -0.195523
C  2.422099 0.640979 1.334072
C  2.150188 0.02938 -1.067588
C  -1.291958 0.768698 -1.774977
C  -1.867173 1.909902 0.370172
C  -1.650222 -2.404861 -0.330312
H  0.4677 -2.394449 -0.083099
H  3.393252 0.117553 1.433607
H  1.887829 0.588148 2.297391
H  2.624933 1.707569 1.093461
H  1.515345 -0.554887 -1.754665
H  3.164366 -0.416085 -1.078456
H  2.233217 1.069329 -1.45542
H  -0.75402 1.629189 -2.229621
H  -2.351265 0.825045 -2.098255
H  -0.863964 -0.167345 -2.17097
H  -1.431501 2.884758 0.062308
H  -1.748553 1.789901 1.46009
H  -2.949836 1.923777 0.13273
H  -2.416688 -1.623817 -0.469811
H  -1.932786 -3.004703 0.55785
H  -1.659869 -3.059293 -1.220956
