program: Orca
programVersion: 5.0.2
elementType: Br Cl S P O O O C C C C C C C C C C C H H H H H H H H H H H H H H H
charge: 0
multiplicity: 1
keywords: wb97x-d3
keywords: def2-TZVPP
keywords: def2/J RIJCOSX
keywords: DEFGRID2
keywords: scfconv7
keywords: smallprint printgap noloewdin
keywords: NOSOSCF
formula: C11H15BrClO3PS
InChI: InChI=1/C11H15BrClO3PS/c1-3-7-18-17(14,15-4-2)16-11-6-5-9(12)8-10(11)13/h5-6,8H,3-4,7H2,1-2H3
33 atoms
Br 4.316768 -1.062233 0.247066
Cl -0.001874 1.799748 2.107809
S  -2.601901 -0.342547 0.779543
P  -2.302746 0.764345 -0.948662
O  -0.966658 1.662221 -0.657701
O  -3.393079 1.906159 -0.974218
O  -2.253051 -0.027991 -2.193185
C  -2.397402 -2.060241 0.171539
C  -0.947738 -2.495895 0.078669
C  -0.837711 -3.958444 -0.325984
C  0.237588 1.046159 -0.469753
C  -3.712459 2.752633 0.156221
C  0.802726 1.024623 0.800327
C  0.913956 0.463754 -1.529634
C  -5.149834 2.54549 0.554442
C  2.022098 0.403164 1.020367
C  2.134516 -0.157892 -1.3260
C  2.672318 -0.192845 -0.048899
H  -2.924841 -2.168674 -0.77521
H  -2.936551 -2.655256 0.91172
H  -0.419496 -1.874578 -0.64728
H  -0.458346 -2.339092 1.042727
H  0.207528 -4.26525 -0.380235
H  -1.33616 -4.612862 0.39177
H  -1.283846 -4.137424 -1.305624
H  -3.041529 2.557575 0.996562
H  -3.533098 3.776967 -0.168471
H  0.49124 0.502646 -2.524412
H  -5.32986 1.528375 0.902012
H  -5.394637 3.226431 1.370123
H  -5.827716 2.758375 -0.272244
H  2.443026 0.393022 2.016685
H  2.645157 -0.608344 -2.166099
elementType: Br Cl S P O C H
totalener: -4428.06604570 hartree
nucrepener: 2291.32226143 hartree
electener: -6719.38830712 hartree
twoeener: 3975.15994607 hartree
cpcmener: -0.02031820 hartree
kineticenergy: 4419.41740876 hartree
xcener: -190.169036883921 hartree
chargesum: -0.0000000
charge: -0.026740 -0.059450 -0.194471 0.816806 -0.342856 -0.348044 -0.597339 -0.066772 -0.081505 -0.268773 0.201711 0.033891 0.010182 -0.145840 -0.221964 -0.073898 -0.092599 -0.057184 0.112709 0.128133 0.054324 0.069395 0.091524 0.086927 0.086491 0.084054 0.111377 0.150872 0.075536 0.092222 0.093258 0.129393 0.148629
qa: -0.0267 -0.0594 -0.1945 0.8168 -0.3429 -0.3480 -0.5973 -0.0668 -0.0815 -0.2688 0.2017 0.0339 0.0102 -0.1458 -0.2220 -0.0739 -0.0926 -0.0572 0.1127 0.1281 0.0543 0.0694 0.0915 0.0869 0.0865 0.0841 0.1114 0.1509 0.0755 0.0922 0.0933 0.1294 0.1486
va: 1.2240 1.2498 2.2840 5.4979 2.0870 2.1287 2.0146 3.8597 3.8928 3.9651 3.8034 3.8694 3.9875 3.9511 3.9316 3.9101 3.8721 3.9861 1.0273 1.0037 1.0192 1.0133 1.0038 1.0012 1.0005 0.9959 0.9957 1.0103 1.0161 1.0081 1.0042 1.0098 0.9941
dispcorr: -0.018725877 hartree
energy: -4428.084771573804
dipole: -63.13478 62.88686 -0.24792 -0.82691 0.77629 -0.05062 -5.04343 6.26622 1.22278
magnitude: 1.24869 au
magnitude: 3.17392 debye
