program: Orca
programVersion: 5.0.2
elementType: Br Cl S P O O O C C C C C C C C C C C H H H H H H H H H H H H H H H
charge: 0
multiplicity: 1
keywords: wb97x-d3
keywords: def2-TZVPP
keywords: def2/J RIJCOSX
keywords: DEFGRID2
keywords: scfconv7
keywords: smallprint printgap noloewdin
keywords: NOSOSCF
formula: C11H15BrClO3PS
InChI: InChI=1/C11H15BrClO3PS/c1-3-7-18-17(14,15-4-2)16-11-6-5-9(12)8-10(11)13/h5-6,8H,3-4,7H2,1-2H3
33 atoms
Br 4.783626 1.134643 -0.538787
Cl 0.822193 -2.329461 1.081215
S  -3.712381 -0.957739 0.472753
P  -2.264296 0.394766 -0.094441
O  -0.96305 -0.088098 0.757014
O  -2.646421 1.714468 0.706168
O  -2.019978 0.524837 -1.546413
C  -3.652479 -2.126989 -0.941132
C  -2.455262 -3.05732 -0.961259
C  -2.365696 -3.97364 0.245269
C  0.318093 0.235964 0.424669
C  -3.417339 2.782763 0.10673
C  1.284133 -0.75761 0.552907
C  0.700671 1.499544 0.001342
C  -4.869047 2.42786 -0.097366
C  2.615966 -0.496748 0.275283
C  2.02716 1.771424 -0.290586
C  2.975689 0.770832 -0.153345
H  -3.733642 -1.549375 -1.860575
H  -4.580179 -2.692959 -0.836218
H  -2.547804 -3.657476 -1.871244
H  -1.533372 -2.482899 -1.074988
H  -3.271662 -4.574045 0.350279
H  -1.525427 -4.661514 0.149459
H  -2.228637 -3.414241 1.170988
H  -3.318259 3.611414 0.805531
H  -2.950224 3.081215 -0.833037
H  -0.024288 2.297902 -0.08508
H  -5.339252 2.096661 0.828378
H  -5.39667 3.319765 -0.438201
H  -5.006852 1.657032 -0.855624
H  3.3477 -1.285064 0.389781
H  2.299124 2.765649 -0.617331
elementType: Br Cl S P O C H
totalener: -4428.06571047 hartree
nucrepener: 2234.08299469 hartree
electener: -6662.14870516 hartree
twoeener: 3918.52132701 hartree
cpcmener: -0.02049810 hartree
kineticenergy: 4419.41728891 hartree
xcener: -190.169259843648 hartree
chargesum: -0.0000000
charge: -0.030579 -0.066194 -0.163645 0.831361 -0.335241 -0.362632 -0.597118 -0.098221 -0.091647 -0.275216 0.208099 0.044243 0.025464 -0.157857 -0.259813 -0.070048 -0.109195 -0.057048 0.127051 0.126462 0.082882 0.053113 0.095028 0.097516 0.069531 0.108256 0.100821 0.147029 0.091940 0.102067 0.088107 0.129104 0.146381
qa: -0.0306 -0.0662 -0.1636 0.8314 -0.3352 -0.3626 -0.5971 -0.0982 -0.0916 -0.2752 0.2081 0.0442 0.0255 -0.1579 -0.2598 -0.0700 -0.1092 -0.0570 0.1271 0.1265 0.0829 0.0531 0.0950 0.0975 0.0695 0.1083 0.1008 0.1470 0.0919 0.1021 0.0881 0.1291 0.1464
va: 1.2217 1.2472 2.2927 5.4548 2.1287 2.1000 1.9840 3.8625 3.8752 3.9216 3.8600 3.8491 3.9555 3.9843 3.9293 3.9183 3.9079 3.9907 1.0240 1.0036 1.0099 1.0293 1.0052 1.0035 1.0153 0.9892 1.0016 1.0035 1.0029 1.0098 1.0085 1.0103 0.9963
dispcorr: -0.017803023 hartree
energy: -4428.083513490345
dipole: -77.16338 75.86314 -1.30024 -12.90110 13.45937 0.55827 -0.80187 0.81823 0.01635
magnitude: 1.41512 au
magnitude: 3.59695 debye
