program: Orca
programVersion: 5.0.2
elementType: Br Cl S P O O O C C C C C C C C C C C H H H H H H H H H H H H H H H
charge: 0
multiplicity: 1
keywords: wb97x-d3
keywords: def2-TZVPP
keywords: def2/J RIJCOSX
keywords: DEFGRID2
keywords: scfconv7
keywords: smallprint printgap noloewdin
keywords: NOSOSCF
formula: C11H15BrClO3PS
InChI: InChI=1/C11H15BrClO3PS/c1-3-7-18-17(14,15-4-2)16-11-6-5-9(12)8-10(11)13/h5-6,8H,3-4,7H2,1-2H3
33 atoms
Br 4.472635 -0.428307 1.045848
Cl 0.634632 0.203775 -2.850238
S  -2.314473 -1.166396 0.87398
P  -2.518452 0.645576 -0.10171
O  -1.076745 1.08263 -0.702749
O  -2.650267 1.683796 1.093648
O  -3.543045 0.684907 -1.163988
C  -2.840805 -2.337523 -0.433495
C  -1.830649 -2.513942 -1.551015
C  -2.276311 -3.597012 -2.523265
C  0.157966 0.737177 -0.250661
C  -3.910782 1.860535 1.785696
C  1.086736 0.301742 -1.191654
C  0.535353 0.834018 1.079365
C  -4.711875 2.98081 1.173749
C  2.374133 -0.04339 -0.814755
C  1.818018 0.485982 1.471409
C  2.727291 0.046868 0.522304
H  -3.816145 -2.02653 -0.806753
H  -2.985949 -3.27264 0.11141
H  -1.704988 -1.572757 -2.089649
H  -0.856937 -2.76875 -1.12751
H  -2.373774 -4.56463 -2.027462
H  -3.239966 -3.357094 -2.975905
H  -1.553684 -3.712628 -3.331702
H  -4.476222 0.925149 1.790885
H  -3.640555 2.085435 2.816222
H  -0.159156 1.194215 1.826668
H  -4.144827 3.911966 1.153712
H  -5.03364 2.744889 0.159441
H  -5.605259 3.148052 1.777182
H  3.076886 -0.379177 -1.565475
H  2.08704 0.567016 2.515627
elementType: Br Cl S P O C H
totalener: -4428.06732280 hartree
nucrepener: 2245.28058715 hartree
electener: -6673.34790996 hartree
twoeener: 3929.26476482 hartree
cpcmener: -0.02170941 hartree
kineticenergy: 4419.39993569 hartree
xcener: -190.166912883930 hartree
chargesum: -0.0000000
charge: -0.028372 -0.064624 -0.178185 0.798944 -0.329859 -0.338285 -0.599046 -0.071296 -0.082170 -0.266345 0.216858 0.049445 0.000630 -0.167758 -0.242684 -0.052185 -0.099554 -0.068094 0.117474 0.125786 0.044907 0.069208 0.085554 0.086062 0.093052 0.090518 0.105540 0.161610 0.088224 0.081891 0.095175 0.128944 0.148633
qa: -0.0284 -0.0646 -0.1782 0.7989 -0.3299 -0.3383 -0.5990 -0.0713 -0.0822 -0.2663 0.2169 0.0494 0.0006 -0.1678 -0.2427 -0.0522 -0.0996 -0.0681 0.1175 0.1258 0.0449 0.0692 0.0856 0.0861 0.0931 0.0905 0.1055 0.1616 0.0882 0.0819 0.0952 0.1289 0.1486
va: 1.2239 1.2454 2.2878 5.4956 2.1188 2.1107 2.0169 3.8523 3.8877 3.9632 3.8156 3.8576 3.9612 3.9533 3.9394 3.9025 3.9172 4.0063 1.0236 1.0033 1.0322 1.0118 1.0010 1.0009 1.0039 1.0038 0.9915 1.0085 1.0045 1.0189 1.0073 1.0105 0.9947
dispcorr: -0.017471589 hartree
energy: -4428.084794389843
dipole: -72.42884 72.09222 -0.33662 -3.35122 2.68520 -0.66602 -7.38765 9.13515 1.74751
magnitude: 1.90018 au
magnitude: 4.82987 debye
