program: Orca
programVersion: 5.0.2
elementType: Br Cl S P O O O C C C C C C C C C C C H H H H H H H H H H H H H H H
charge: 0
multiplicity: 1
keywords: wb97x-d3
keywords: def2-TZVPP
keywords: def2/J RIJCOSX
keywords: DEFGRID2
keywords: scfconv7
keywords: smallprint printgap noloewdin
keywords: NOSOSCF
formula: C11H15BrClO3PS
InChI: InChI=1/C11H15BrClO3PS/c1-3-7-18-17(14,15-4-2)16-11-6-5-9(12)8-10(11)13/h5-6,8H,3-4,7H2,1-2H3
33 atoms
Br 4.337977 -0.465586 1.249457
Cl 0.794392 0.145424 -2.919743
S  -2.560501 -1.016467 0.665667
P  -2.563393 0.787954 -0.344797
O  -1.06501 1.035123 -0.917478
O  -2.624198 1.876936 0.809018
O  -3.535036 0.903896 -1.449161
C  -3.033628 -2.162778 -0.689277
C  -1.979414 -2.367128 -1.761256
C  -0.669314 -2.940724 -1.251664
C  0.127603 0.693835 -0.3659
C  -3.859562 2.476463 1.262877
C  1.125499 0.258829 -1.234006
C  0.40487 0.786571 0.989828
C  -4.645587 1.571282 2.176756
C  2.381701 -0.082676 -0.762508
C  1.654373 0.437114 1.476729
C  2.633478 0.004618 0.597586
H  -3.975774 -1.815992 -1.110958
H  -3.23992 -3.09734 -0.16358
H  -2.416135 -3.051947 -2.494156
H  -1.805563 -1.432433 -2.29797
H  -0.196735 -2.292799 -0.512228
H  -0.821571 -3.916454 -0.78596
H  0.038069 -3.073722 -2.070447
H  -3.547712 3.378439 1.786431
H  -4.453165 2.780391 0.399421
H  -0.340927 1.14579 1.68583
H  -4.046904 1.234135 3.023215
H  -5.495261 2.130198 2.571225
H  -5.040097 0.697845 1.657732
H  3.140243 -0.414277 -1.458492
H  1.843519 0.515416 2.538539
elementType: Br Cl S P O C H
totalener: -4428.06579207 hartree
nucrepener: 2280.51406538 hartree
electener: -6708.57985745 hartree
twoeener: 3964.46288535 hartree
cpcmener: -0.02146655 hartree
kineticenergy: 4419.41111338 hartree
xcener: -190.173000903769 hartree
chargesum: -0.0000000
charge: -0.029967 -0.066047 -0.177424 0.804106 -0.324453 -0.336295 -0.599530 -0.088298 -0.105309 -0.265927 0.217742 0.030283 -0.003613 -0.162107 -0.251702 -0.047201 -0.109602 -0.064665 0.129204 0.126410 0.088055 0.055153 0.066425 0.101056 0.094507 0.106563 0.102814 0.154943 0.091529 0.101891 0.087247 0.126255 0.147959
qa: -0.0300 -0.0660 -0.1774 0.8041 -0.3245 -0.3363 -0.5995 -0.0883 -0.1053 -0.2659 0.2177 0.0303 -0.0036 -0.1621 -0.2517 -0.0472 -0.1096 -0.0647 0.1292 0.1264 0.0881 0.0552 0.0664 0.1011 0.0945 0.1066 0.1028 0.1549 0.0915 0.1019 0.0872 0.1263 0.1480
va: 1.2225 1.2446 2.2759 5.4902 2.1249 2.1218 2.0191 3.8642 3.8653 3.9258 3.8261 3.8573 3.9302 3.9388 3.9051 3.8915 3.9344 4.0018 1.0219 1.0033 1.0111 1.0342 1.0064 1.0060 1.0071 0.9898 1.0051 1.0144 1.0020 1.0105 1.0106 1.0115 0.9956
dispcorr: -0.019358133 hartree
energy: -4428.085150201097
dipole: -67.54523 67.02707 -0.51816 -3.24104 2.75031 -0.49073 -4.75125 6.44233 1.69108
magnitude: 1.83550 au
magnitude: 4.66547 debye
