program: Orca
programVersion: 5.0.2
elementType: Br Cl S P O O O C C C C C C C C C C C H H H H H H H H H H H H H H H
charge: 0
multiplicity: 1
keywords: wb97x-d3
keywords: def2-TZVPP
keywords: def2/J RIJCOSX
keywords: DEFGRID2
keywords: scfconv7
keywords: smallprint printgap noloewdin
keywords: NOSOSCF
formula: C11H15BrClO3PS
InChI: InChI=1/C11H15BrClO3PS/c1-3-7-18-17(14,15-4-2)16-11-6-5-9(12)8-10(11)13/h5-6,8H,3-4,7H2,1-2H3
33 atoms
Br 4.693798 -0.521052 0.222797
Cl 0.215374 1.318436 2.843083
S  -2.156966 -0.941885 1.06865
P  -2.167825 0.624851 -0.283493
O  -0.933536 1.594392 0.176604
O  -3.387846 1.506334 0.211546
O  -2.112177 0.244547 -1.707966
C  -1.507416 -2.28616 0.00621
C  -2.577316 -2.964806 -0.828531
C  -2.000991 -4.13248 -1.617517
C  0.334865 1.096162 0.163378
C  -4.1686 2.289962 -0.706337
C  1.004098 0.925162 1.371083
C  0.975855 0.774064 -1.024134
C  -3.41928 3.496495 -1.223486
C  2.305142 0.446998 1.392916
C  2.273347 0.290581 -1.013175
C  2.929461 0.12971 0.197159
H  -1.060724 -2.984232 0.716682
H  -0.697618 -1.900341 -0.61174
H  -3.378988 -3.313246 -0.17402
H  -3.016641 -2.23643 -1.509906
H  -1.568832 -4.888629 -0.960074
H  -2.772827 -4.618714 -2.213343
H  -1.218503 -3.801758 -2.301882
H  -4.50683 1.659354 -1.530703
H  -5.043821 2.591823 -0.133273
H  0.454606 0.907957 -1.961886
H  -4.093459 4.1097 -1.821997
H  -3.040522 4.109772 -0.407008
H  -2.583381 3.209483 -1.860688
H  2.811441 0.323268 2.339752
H  2.761556 0.044738 -1.945635
totalener: -4428.04475094 hartree
nucrepener: 2256.76634626 hartree
electener: -6684.81109719 hartree
twoeener: 3940.56837486 hartree
kineticenergy: 4419.47660942 hartree
xcener: -190.174992227269 hartree
chargesum: -0.0000000
charge: -0.018513 -0.042881 -0.147165 0.779144 -0.319850 -0.332968 -0.524601 -0.088299 -0.094913 -0.253270 0.178677 0.020853 -0.001964 -0.151142 -0.242262 -0.067750 -0.073401 -0.069863 0.114319 0.101822 0.062363 0.078045 0.072853 0.088186 0.081202 0.094778 0.095578 0.141219 0.083648 0.093329 0.091243 0.119809 0.131775
qa: -0.0185 -0.0429 -0.1472 0.7791 -0.3199 -0.3330 -0.5246 -0.0883 -0.0949 -0.2533 0.1787 0.0209 -0.0020 -0.1511 -0.2423 -0.0677 -0.0734 -0.0699 0.1143 0.1018 0.0624 0.0780 0.0729 0.0882 0.0812 0.0948 0.0956 0.1412 0.0836 0.0933 0.0912 0.1198 0.1318
va: 1.2327 1.2673 2.3000 5.4890 2.1061 2.1492 2.0620 3.8808 3.8871 3.9539 3.8837 3.9080 4.0054 3.9581 3.8988 3.9193 3.8828 4.0489 1.0090 1.0192 1.0135 1.0295 1.0031 1.0065 1.0030 1.0012 0.9893 1.0194 1.0106 1.0063 1.0174 1.0144 1.0004
dispcorr: -0.017155931 hartree
energy: -4428.061906866540
dipole: -67.73603 67.24409 -0.49194 -4.06763 4.01554 -0.05209 -19.64325 19.28552 -0.35773
magnitude: 0.61048 au
magnitude: 1.55173 debye
