program: Orca
programVersion: 5.0.2
elementType: Br Cl S P O O O C C C C C C C C C C C H H H H H H H H H H H H H H H
charge: 0
multiplicity: 1
keywords: wb97x-d3
keywords: def2-TZVPP
keywords: def2/J RIJCOSX
keywords: DEFGRID2
keywords: scfconv7
keywords: smallprint printgap noloewdin
keywords: NOSOSCF
formula: C11H15BrClO3PS
InChI: InChI=1/C11H15BrClO3PS/c1-3-7-18-17(14,15-4-2)16-11-6-5-9(12)8-10(11)13/h5-6,8H,3-4,7H2,1-2H3
33 atoms
Br 4.607701 1.266197 -0.385397
Cl -0.176593 1.767956 2.295485
S  -3.759043 -1.297944 0.71056
P  -2.174804 -0.434996 -0.276417
O  -0.97133 -0.629921 0.814123
O  -2.548157 1.106941 -0.159819
O  -1.826477 -0.933596 -1.620225
C  -3.296914 -3.065331 0.5549
C  -3.663854 -3.682412 -0.783178
C  -3.29108 -5.158699 -0.826094
C  0.287228 -0.197853 0.51122
C  -2.525748 1.980535 -1.301788
C  0.797618 0.920121 1.163018
C  1.073852 -0.868101 -0.413068
C  -1.132988 2.491777 -1.585712
C  2.088255 1.356935 0.905225
C  2.361559 -0.438425 -0.682317
C  2.859564 0.673992 -0.021479
H  -3.835971 -3.551026 1.370515
H  -2.234603 -3.17674 0.777296
H  -4.735665 -3.560637 -0.952754
H  -3.15686 -3.144134 -1.583949
H  -2.219426 -5.303661 -0.68035
H  -3.809899 -5.728782 -0.053506
H  -3.551788 -5.597391 -1.788728
H  -2.937589 1.47027 -2.174276
H  -3.196868 2.798155 -1.041737
H  0.673195 -1.732766 -0.922965
H  -0.70576 2.981281 -0.710882
H  -0.467194 1.687102 -1.89742
H  -1.170793 3.221934 -2.394942
H  2.470615 2.224905 1.424046
H  2.96471 -0.969925 -1.404682
totalener: -4428.04483008 hartree
nucrepener: 2243.37166997 hartree
electener: -6671.41650005 hartree
twoeener: 3927.09491023 hartree
kineticenergy: 4419.46169777 hartree
xcener: -190.171349533424 hartree
chargesum: -0.0000000
charge: -0.018286 -0.044231 -0.130846 0.774747 -0.331512 -0.335636 -0.518591 -0.117659 -0.095411 -0.249567 0.231056 0.037366 -0.051503 -0.130951 -0.257483 -0.052619 -0.075172 -0.074209 0.115821 0.100705 0.058788 0.084389 0.076232 0.073917 0.090213 0.094182 0.095127 0.124839 0.086448 0.095106 0.095499 0.119237 0.130006
qa: -0.0183 -0.0442 -0.1308 0.7747 -0.3315 -0.3356 -0.5186 -0.1177 -0.0954 -0.2496 0.2311 0.0374 -0.0515 -0.1310 -0.2575 -0.0526 -0.0752 -0.0742 0.1158 0.1007 0.0588 0.0844 0.0762 0.0739 0.0902 0.0942 0.0951 0.1248 0.0864 0.0951 0.0955 0.1192 0.1300
va: 1.2331 1.2661 2.3172 5.5117 2.0976 2.1306 2.0693 3.9066 3.8726 3.9473 3.8344 3.8822 4.0336 4.0187 3.9125 3.8931 3.8943 4.0524 1.0050 1.0233 1.0152 1.0324 1.0039 1.0026 1.0063 1.0041 0.9907 1.0217 1.0082 1.0085 1.0146 1.0152 1.0012
dispcorr: -0.017870678 hartree
energy: -4428.062700756083
dipole: -64.94626 64.63125 -0.31502 -31.03081 30.77875 -0.25207 -10.63196 10.43495 -0.19701
magnitude: 0.44899 au
magnitude: 1.14123 debye
