program: Orca
programVersion: 5.0.2
elementType: Br Cl S P O O O C C C C C C C C C C C H H H H H H H H H H H H H H H
charge: 0
multiplicity: 1
keywords: wb97x-d3
keywords: def2-TZVPP
keywords: def2/J RIJCOSX
keywords: DEFGRID2
keywords: scfconv7
keywords: smallprint printgap noloewdin
keywords: NOSOSCF
formula: C11H15BrClO3PS
InChI: InChI=1/C11H15BrClO3PS/c1-3-7-18-17(14,15-4-2)16-11-6-5-9(12)8-10(11)13/h5-6,8H,3-4,7H2,1-2H3
33 atoms
Br 4.23165 0.037244 1.57316
Cl 0.493609 -1.065661 -2.314277
S  -2.362854 -1.107105 0.004605
P  -2.43594 0.846479 -0.680013
O  -0.95545 1.234524 -1.218752
O  -2.460083 1.692024 0.677037
O  -3.465646 1.111359 -1.690982
C  -3.062874 -1.960379 -1.462435
C  -3.092609 -3.459643 -1.211471
C  -1.716482 -4.098532 -1.097386
C  0.195709 0.950555 -0.550593
C  -3.658165 1.780328 1.460944
C  0.99055 -0.108897 -0.975802
C  0.622512 1.735565 0.509144
C  -3.433032 2.804576 2.545826
C  2.194588 -0.386321 -0.347633
C  1.822051 1.46874 1.145758
C  2.599305 0.405056 0.715155
H  -2.446574 -1.726924 -2.329678
H  -4.061623 -1.566006 -1.635398
H  -3.686856 -3.672617 -0.319382
H  -3.634993 -3.907635 -2.048383
H  -1.157259 -3.712417 -0.245219
H  -1.800375 -5.178022 -0.9758
H  -1.120082 -3.909437 -1.99041
H  -4.49452 2.068572 0.820932
H  -3.883514 0.800019 1.888667
H  0.015716 2.570053 0.829996
H  -3.226497 3.787333 2.124337
H  -4.326779 2.885678 3.163883
H  -2.602964 2.522866 3.19253
H  2.798812 -1.213188 -0.693193
H  2.142417 2.091259 1.969129
totalener: -4428.04515272 hartree
nucrepener: 2259.29574241 hartree
electener: -6687.34089513 hartree
twoeener: 3942.76093189 hartree
kineticenergy: 4419.46377970 hartree
xcener: -190.174534022480 hartree
chargesum: -0.0000000
charge: -0.016846 -0.056292 -0.186179 0.780559 -0.320327 -0.331677 -0.497952 -0.115449 -0.105844 -0.241178 0.162563 0.018235 0.040556 -0.105102 -0.240078 -0.080465 -0.093304 -0.060799 0.103677 0.128229 0.069703 0.074469 0.081240 0.092112 0.069519 0.106769 0.087911 0.129741 0.088578 0.083422 0.084350 0.121597 0.128261
qa: -0.0168 -0.0563 -0.1862 0.7806 -0.3203 -0.3317 -0.4980 -0.1154 -0.1058 -0.2412 0.1626 0.0182 0.0406 -0.1051 -0.2401 -0.0805 -0.0933 -0.0608 0.1037 0.1282 0.0697 0.0745 0.0812 0.0921 0.0695 0.1068 0.0879 0.1297 0.0886 0.0834 0.0844 0.1216 0.1283
va: 1.2344 1.2569 2.2720 5.5284 2.1476 2.1125 2.1458 3.9265 3.8926 3.9274 3.9066 3.8733 3.9587 3.9984 3.9558 3.9395 3.9133 4.0542 1.0141 1.0216 1.0132 1.0058 1.0091 1.0081 1.0092 0.9948 0.9977 1.0135 1.0055 1.0101 1.0039 1.0134 1.0015
dispcorr: -0.017112048 hartree
energy: -4428.062264766811
dipole: -67.23920 66.93366 -0.30554 -7.24877 6.90447 -0.34430 -7.40319 8.51979 1.11661
magnitude: 1.20777 au
magnitude: 3.06991 debye
