program: Orca
programVersion: 5.0.2
elementType: Br Cl S P O O O C C C C C C C C C C C H H H H H H H H H H H H H H H
charge: 0
multiplicity: 1
keywords: wb97x-d3
keywords: def2-TZVPP
keywords: def2/J RIJCOSX
keywords: DEFGRID2
keywords: scfconv7
keywords: smallprint printgap noloewdin
keywords: NOSOSCF
formula: C11H15BrClO3PS
InChI: InChI=1/C11H15BrClO3PS/c1-3-7-18-17(14,15-4-2)16-11-6-5-9(12)8-10(11)13/h5-6,8H,3-4,7H2,1-2H3
33 atoms
Br 3.924949 2.752763 -0.538595
Cl 0.228829 0.186431 2.632252
S  -2.738111 -2.772071 0.607002
P  -1.82354 -1.216402 -0.398786
O  -0.339583 -1.407097 0.243329
O  -2.304346 0.144636 0.284547
O  -1.901136 -1.237741 -1.872583
C  -3.839259 -3.437731 -0.698359
C  -5.265427 -2.920234 -0.618983
C  -5.396057 -1.422442 -0.837806
C  0.609613 -0.448858 0.044215
C  -2.75364 1.279109 -0.471862
C  0.98812 0.367447 1.103778
C  1.217185 -0.296291 -1.19211
C  -1.60778 2.188059 -0.850854
C  1.979392 1.321446 0.93386
C  2.204975 0.656764 -1.374627
C  2.577758 1.460555 -0.308284
H  -3.810831 -4.517066 -0.546595
H  -3.387469 -3.23213 -1.668236
H  -5.8409 -3.455203 -1.380341
H  -5.702165 -3.19586 0.343531
H  -4.94496 -0.864448 -0.01692
H  -4.91291 -1.1146 -1.766239
H  -6.443676 -1.127869 -0.892484
H  -3.29731 0.951096 -1.359336
H  -3.458164 1.793533 0.181298
H  0.916459 -0.934708 -2.01176
H  -0.928265 1.705631 -1.552819
H  -1.999091 3.085164 -1.331935
H  -1.039334 2.498143 0.025679
H  2.268342 1.945107 1.768055
H  2.674329 0.764744 -2.342178
totalener: -4428.04385673 hartree
nucrepener: 2263.55139111 hartree
electener: -6691.59524784 hartree
twoeener: 3947.24153380 hartree
kineticenergy: 4419.46898057 hartree
xcener: -190.175377775668 hartree
chargesum: 0.0000000
charge: -0.016666 -0.041961 -0.145020 0.789828 -0.334363 -0.323307 -0.522679 -0.124944 -0.086299 -0.273760 0.198053 0.026936 -0.012868 -0.161775 -0.261790 -0.081966 -0.078128 -0.054963 0.116319 0.119479 0.068063 0.066616 0.079393 0.086987 0.093870 0.097582 0.100512 0.141218 0.095833 0.096712 0.090830 0.120177 0.132084
qa: -0.0167 -0.0420 -0.1450 0.7898 -0.3344 -0.3233 -0.5227 -0.1249 -0.0863 -0.2738 0.1981 0.0269 -0.0129 -0.1618 -0.2618 -0.0820 -0.0781 -0.0550 0.1163 0.1195 0.0681 0.0666 0.0794 0.0870 0.0939 0.0976 0.1005 0.1412 0.0958 0.0967 0.0908 0.1202 0.1321
va: 1.2337 1.2694 2.2962 5.4853 2.1577 2.0848 2.0710 3.8843 3.8754 3.9318 3.8746 3.8683 4.0046 3.9872 3.9545 3.9104 3.8854 4.0371 1.0060 1.0326 1.0097 1.0112 1.0101 1.0070 1.0116 0.9960 0.9878 1.0153 1.0055 1.0142 1.0029 1.0156 1.0003
dispcorr: -0.019256176 hartree
energy: -4428.063112910780
dipole: -72.22469 71.37567 -0.84901 -30.29520 30.47655 0.18135 -9.79482 9.49139 -0.30343
magnitude: 0.91966 au
magnitude: 2.33760 debye
