program: Orca
programVersion: 5.0.2
elementType: Br Cl S P O O O C C C C C C C C C C C H H H H H H H H H H H H H H H
charge: 0
multiplicity: 1
keywords: wb97x-d3
keywords: def2-TZVPP
keywords: def2/J RIJCOSX
keywords: DEFGRID2
keywords: scfconv7
keywords: smallprint printgap noloewdin
keywords: NOSOSCF
formula: C11H15BrClO3PS
InChI: InChI=1/C11H15BrClO3PS/c1-3-7-18-17(14,15-4-2)16-11-6-5-9(12)8-10(11)13/h5-6,8H,3-4,7H2,1-2H3
33 atoms
Br 4.700473 -0.454283 -0.448004
Cl 0.349924 1.432923 2.348276
S  -1.998739 -1.096248 1.190562
P  -2.269173 0.204506 -0.390326
O  -1.049702 1.269899 -0.186433
O  -3.500043 1.111822 0.041572
O  -2.332411 -0.410302 -1.72959
C  -2.589332 -2.642704 0.414144
C  -4.099324 -2.730787 0.285373
C  -4.529847 -4.087706 -0.254664
C  0.247329 0.860674 -0.277424
C  -4.127169 2.018201 -0.881873
C  1.03837 0.907339 0.865271
C  0.794903 0.422153 -1.47232
C  -5.624942 1.915908 -0.72164
C  2.369341 0.527338 0.81745
C  2.123423 0.034864 -1.531146
C  2.900278 0.086643 -0.384217
H  -2.209911 -3.424612 1.075122
H  -2.095619 -2.75994 -0.549634
H  -4.558772 -2.547579 1.258698
H  -4.452875 -1.942292 -0.381731
H  -4.217893 -4.898144 0.40599
H  -5.613724 -4.143269 -0.352155
H  -4.100828 -4.278097 -1.239198
H  -3.774485 3.025129 -0.65217
H  -3.836756 1.784171 -1.908253
H  0.177401 0.382717 -2.358987
H  -5.931114 2.134581 0.300725
H  -6.114936 2.633149 -1.380331
H  -5.982019 0.920285 -0.983126
H  2.969283 0.567972 1.715455
H  2.53991 -0.30814 -2.467647
totalener: -4428.04680011 hartree
nucrepener: 2221.05508504 hartree
electener: -6649.10188516 hartree
twoeener: 3904.94453554 hartree
kineticenergy: 4419.46734789 hartree
xcener: -190.172136959675 hartree
chargesum: 0.0000000
charge: -0.020585 -0.048774 -0.149518 0.781287 -0.341389 -0.317181 -0.522426 -0.089647 -0.088198 -0.256620 0.193024 0.019301 -0.018226 -0.132813 -0.225809 -0.058487 -0.079134 -0.073098 0.109671 0.116836 0.065883 0.064213 0.075098 0.087060 0.084360 0.098899 0.091031 0.135605 0.088855 0.079217 0.082092 0.120165 0.129308
qa: -0.0206 -0.0488 -0.1495 0.7813 -0.3414 -0.3172 -0.5224 -0.0896 -0.0882 -0.2566 0.1930 0.0193 -0.0182 -0.1328 -0.2258 -0.0585 -0.0791 -0.0731 0.1097 0.1168 0.0659 0.0642 0.0751 0.0871 0.0844 0.0989 0.0910 0.1356 0.0889 0.0792 0.0821 0.1202 0.1293
va: 1.2309 1.2638 2.3221 5.4998 2.1346 2.1286 2.0727 3.8928 3.8933 3.9569 3.9112 3.8846 4.0101 4.0156 3.9476 3.9061 3.9030 4.0472 1.0068 1.0270 1.0145 1.0233 1.0032 1.0059 1.0024 0.9926 1.0031 1.0208 1.0043 1.0101 1.0068 1.0128 1.0012
dispcorr: -0.015992516 hartree
energy: -4428.062792630219
dipole: -86.12437 85.20954 -0.91484 -9.69401 9.59737 -0.09664 -5.74602 5.59160 -0.15441
magnitude: 0.93280 au
magnitude: 2.37098 debye
