program: Orca
programVersion: 5.0.2
elementType: Br Cl S P O O O C C C C C C C C C C C H H H H H H H H H H H H H H H
charge: 0
multiplicity: 1
keywords: wb97x-d3
keywords: def2-TZVPP
keywords: def2/J RIJCOSX
keywords: DEFGRID2
keywords: scfconv7
keywords: smallprint printgap noloewdin
keywords: NOSOSCF
formula: C11H15BrClO3PS
InChI: InChI=1/C11H15BrClO3PS/c1-3-7-18-17(14,15-4-2)16-11-6-5-9(12)8-10(11)13/h5-6,8H,3-4,7H2,1-2H3
33 atoms
Br 4.274416 1.742281 0.907843
Cl -0.45447 -0.635353 2.420267
S  -3.632984 -1.593924 -1.071507
P  -2.074641 -0.257666 -1.151183
O  -0.852469 -1.086102 -0.454742
O  -2.306736 0.860932 -0.032023
O  -1.840651 0.227457 -2.520498
C  -3.752637 -2.008139 0.713617
C  -2.962498 -3.241359 1.116788
C  -3.388523 -4.506922 0.390569
C  0.303444 -0.42364 -0.159021
C  -2.651204 2.209044 -0.385503
C  0.621376 -0.156667 1.16757
C  1.175054 -0.033444 -1.163282
C  -1.409297 3.055973 -0.536717
C  1.806489 0.484635 1.491729
C  2.359939 0.611529 -0.852414
C  2.666296 0.868626 0.474799
H  -4.820376 -2.163829 0.877391
H  -3.464326 -1.135698 1.298068
H  -1.8982 -3.060326 0.969817
H  -3.1041 -3.37099 2.194026
H  -3.204438 -4.433066 -0.681256
H  -2.834595 -5.369388 0.759453
H  -4.450722 -4.712852 0.533428
H  -3.246777 2.228214 -1.300368
H  -3.2785 2.571752 0.428295
H  0.923579 -0.244797 -2.193682
H  -0.811434 2.728147 -1.385601
H  -1.690687 4.09552 -0.705976
H  -0.792344 3.016206 0.360397
H  2.041177 0.681034 2.528362
H  3.032703 0.908008 -1.644454
totalener: -4428.04533641 hartree
nucrepener: 2276.49908818 hartree
electener: -6704.54442459 hartree
twoeener: 3959.94620447 hartree
kineticenergy: 4419.46545397 hartree
xcener: -190.173201646655 hartree
chargesum: -0.0000000
charge: -0.015650 -0.060524 -0.136054 0.752303 -0.340928 -0.319615 -0.508224 -0.136504 -0.092775 -0.243593 0.224081 0.030679 0.013891 -0.164646 -0.244104 -0.082264 -0.066926 -0.069225 0.117803 0.114068 0.061341 0.069682 0.084291 0.086616 0.073884 0.093987 0.091685 0.143675 0.094459 0.091076 0.083413 0.122015 0.132086
qa: -0.0157 -0.0605 -0.1361 0.7523 -0.3409 -0.3196 -0.5082 -0.1365 -0.0928 -0.2436 0.2241 0.0307 0.0139 -0.1646 -0.2441 -0.0823 -0.0669 -0.0692 0.1178 0.1141 0.0613 0.0697 0.0843 0.0866 0.0739 0.0940 0.0917 0.1437 0.0945 0.0911 0.0834 0.1220 0.1321
va: 1.2350 1.2495 2.3038 5.5283 2.0931 2.0745 2.1151 3.8776 3.8754 3.9442 3.8155 3.8929 3.9960 4.0285 3.9109 3.9220 3.8850 4.0555 1.0087 1.0307 1.0314 1.0072 1.0153 1.0066 1.0029 1.0034 0.9928 1.0118 1.0154 1.0149 1.0035 1.0115 0.9996
dispcorr: -0.018985611 hartree
energy: -4428.064322017806
dipole: -62.90739 62.51903 -0.38837 -22.87883 23.08644 0.20761 -9.22765 10.18953 0.96188
magnitude: 1.05790 au
magnitude: 2.68896 debye
