program: Gaussian 09
title: 000066291
version: EM64L-G09RevD.01
frameworkgroup: C1[X(C12H26O)]
method: RPBEPBE
basis: SDD
operation: Freq
keyword: #pfreq=noraman
keyword: PBEPBE/SDD
title: #p freq=noraman PBEPBE/SDD
converged: YES YES NO NO
title: Mulliken charges:
elementType: O C C C C C C C C C C C C H H H H H H H H H H H H H H H H H H H H H H H H H H
charge: -0.445847 -0.391203 -0.448896 -0.386355 -0.069089 -0.371604 -0.372851 -0.405872 -0.352230 -0.339964 -0.356365 -0.698000 -0.696208 0.194532 0.200435 0.222378 0.181611 0.198425 0.198071 0.225028 0.190005 0.189328 0.190141 0.188808 0.204992 0.186697 0.187228 0.187719 0.191972 0.221983 0.195273 0.194964 0.317782 0.208540 0.218353 0.205595 0.215385 0.209625 0.209615
chargesum: 0.00000
title: Mulliken charges with hydrogens summed into heavy atoms:
elementType: O C C C C C C C C C C C C
charge: -0.128065 0.003764 -0.044907 0.010141 0.155939 0.007729 0.006098 -0.014183 0.022716 0.073991 0.033873 -0.065513 -0.061583
polarizability: 1.61234415e+02 -2.31467665e+00 1.26668647e+02 -1.20676935e-01 -1.21761856e+00 1.16449408e+02
1716.lowfreq: -14.7570 -3.9930 -0.0005 -0.0004 0.0010 14.0860 23.8010 46.3959 51.4994
frequency: 22.7813 46.3388 50.8522 62.1938 76.7691 95.2223 100.3444 115.8578 128.2642 145.2943 155.1766 209.9537 228.1557 230.8383 235.3450 247.3227 296.5646 326.4402 342.5931 400.5330 432.8393 463.5876 474.0558 536.3170 719.7037 724.7969 740.6236 745.7816 786.4959 825.1631 846.7183 884.3375 888.5011 900.1275 920.9231 944.6643 987.1549 1001.1005 1020.9223 1030.1340 1041.7050 1062.7020 1067.6088 1073.1542 1080.9445 1092.4969 1110.9722 1130.4226 1154.5159 1178.5690 1191.1915 1211.3147 1228.9688 1236.8624 1261.2751 1270.3724 1271.4833 1281.4205 1287.7488 1292.1418 1294.6934 1301.2398 1317.3876 1329.5827 1339.9810 1351.3497 1356.7681 1357.7687 1363.4269 1369.7616 1389.1929 1390.8993 1454.2369 1461.5090 1462.4899 1464.8118 1466.9983 1470.3242 1475.9283 1476.8052 1477.8153 1478.0668 1484.8005 1487.5463 1489.7773 2943.4472 2947.7887 2950.6258 2951.3211 2955.8804 2961.1133 2968.4259 2970.0603 2971.2338 2972.2870 2976.6799 2984.0874 2991.3156 3000.6238 3003.0083 3012.0572 3021.1385 3032.2060 3036.5130 3042.8113 3045.8180 3068.5069 3068.7037 3070.6651 3070.9469 3534.0888
redmass: 3.6677 3.1588 2.2380 2.0230 1.8900 2.8922 1.7906 2.7387 2.4873 1.8728 2.5918 2.6910 2.1322 1.1993 1.1813 2.8177 1.3605 2.3405 2.6378 3.4379 2.4759 2.7762 2.8509 2.7095 1.0859 1.1237 1.1620 1.2168 1.4099 1.5246 1.3974 1.8681 1.7136 1.7809 1.4843 2.2307 1.5147 3.0481 1.8967 2.5625 1.8741 1.5125 2.0723 2.5375 2.1485 2.2935 1.9646 2.4562 2.0481 1.4250 1.6633 1.4660 1.3382 1.3542 1.3026 1.2496 1.3032 1.0432 1.1653 1.1482 1.0797 1.1592 1.3473 1.3438 1.4954 1.4907 1.6850 1.6139 1.4956 1.2117 1.2186 1.2188 1.0826 1.0740 1.0714 1.0758 1.0827 1.0784 1.0523 1.0472 1.0677 1.0485 1.0864 1.0815 1.0926 1.0631 1.0624 1.0589 1.0589 1.0596 1.0596 1.0590 1.0378 1.0578 1.0366 1.0639 1.0964 1.0984 1.0990 1.0939 1.1004 1.0989 1.1012 1.0988 1.1033 1.0928 1.1008 1.1006 1.0989 1.0993 1.0657
irintensity: 0.0466 0.9100 0.0383 0.0971 0.0253 1.0750 0.1487 0.5730 0.0316 0.0531 1.5527 1.5743 5.0819 0.6167 0.2263 2.5987 85.6365 44.9096 0.1691 6.9084 4.1320 0.8382 10.3974 1.3375 18.0801 0.1964 4.9280 6.7506 1.4323 12.9332 6.2180 11.9130 6.3390 10.3019 4.5960 33.7001 6.0577 1.3517 9.4221 5.2600 2.4976 32.7040 21.8030 0.1556 0.8691 3.6402 9.5101 16.4645 3.2192 1.7431 1.9781 7.0416 4.3696 3.2604 5.2930 1.7121 2.1457 0.0556 1.4692 0.1097 1.2735 3.3292 0.4229 2.6251 1.4312 0.7298 0.9976 10.5658 0.7473 27.9628 10.8842 9.6193 3.2895 2.0012 0.7632 4.5366 4.5179 2.5861 3.1740 10.8850 3.0193 11.6066 3.9666 13.8687 25.5948 14.6919 36.4773 0.7425 0.5879 4.9390 20.6657 58.4433 36.1843 145.0545 39.8923 41.6442 0.3876 0.5251 6.9836 11.1090 3.3635 4.2248 0.9291 9.6510 214.4623 54.0299 78.1722 113.4216 49.6110 59.1259 3.7665
temp: 298.150 k
press: 1.00000 atm
elementType: 8 6 6 6 6 6 6 6 6 6 6 6 6 1 1 1 1 1 1 1 1 1 1 1 1 1 1 1 1 1 1 1 1 1 1 1 1 1 1
symmnumber: 1
zpe: 937759.7 jmol-1
zpe.correction: 0.357174 hartree
zpe.thermalcorrener: 0.374954 hartree
zpe.thermalcorrenthalpy: 0.375898 hartree
zpe.thermalcorrgfe: 0.309789 hartree
zpe.sumelectzpe: -546.981253 hartree
zpe.sumelectthermal: -546.963473 hartree
zpe.sumelectthermalent: -546.962529 hartree
zpe.sumelectthermalfe: -547.028638 hartree
dipole: -0.6022 0.0705 1.8503
dipole: 1.9471
quadrupole: -87.3303 -84.4787 -89.3606
quadrupole: 0.2676 8.6196 -3.2148
quadrupole: -0.2738 2.5779 -2.3041 0.2676 8.6196 -3.2148
hfenergy: -547.3384271 hartree
pointgroup: C01 [X(C12H26O1)]
dipole: 0.2388408 -0.0321161 0.7271538 debye
polarizability: 161.2225507|-2.4006604|126.6679279|-0.0121782|1.2767545|116.4619914 unknown
InChI: InChI=1S/C12H26O/c1-3-5-6-7-8-9-11-12(13)10-4-2/h12-13H,3-11H2,1-2H3
charge 0 multiplicity 1
39 atoms
O  -3.96511 1.311781 -1.125099
C  -0.695444 1.372268 0.989798
C  -2.041868 1.80099 0.354021
C  0.365643 0.884308 -0.024368
C  -2.791633 0.707549 -0.442288
C  1.737522 0.608017 0.631266
C  2.802874 0.096301 -0.364399
C  -3.220926 -0.505177 0.41071
C  4.174283 -0.177652 0.293111
C  -3.899546 -1.622852 -0.411971
C  5.240142 -0.689424 -0.702797
C  -4.39271 -2.794892 0.462547
C  6.60645 -0.962836 -0.037597
H  -0.282843 2.240715 1.542987
H  -0.867121 0.582359 1.74914
H  -1.871229 2.652105 -0.3344
H  -2.716982 2.170526 1.157166
H  0.48554 1.645157 -0.823867
H  0.014131 -0.040543 -0.526043
H  -2.17297 0.362965 -1.29044
H  1.610511 -0.135969 1.445857
H  2.104515 1.537299 1.115548
H  2.929421 0.839246 -1.179633
H  2.436378 -0.833975 -0.847178
H  -2.331003 -0.920604 0.925549
H  -3.909843 -0.155936 1.211405
H  4.048846 -0.921436 1.107941
H  4.542824 0.751777 0.775965
H  -3.18123 -2.000703 -1.168306
H  -4.743549 -1.186852 -0.979222
H  5.365665 0.055126 -1.515518
H  4.8706 -1.616832 -1.186376
H  -4.562668 1.685169 -0.42605
H  -5.143908 -2.452813 1.19981
H  -4.861551 -3.585268 -0.151998
H  -3.558105 -3.25536 1.025263
H  7.351372 -1.320349 -0.772234
H  7.008641 -0.045463 0.432606
H  6.515784 -1.731523 0.753092
