program: Orca
programVersion: 5.0.2
elementType: Br Cl S P O O O C C C C C C C C C C C H H H H H H H H H H H H H H H
charge: 0
multiplicity: 1
keywords: wb97x-d3
keywords: def2-TZVPP
keywords: def2/J RIJCOSX
keywords: DEFGRID2
keywords: scfconv7
keywords: smallprint printgap noloewdin
keywords: NOSOSCF
formula: C11H15BrClO3PS
InChI: InChI=1/C11H15BrClO3PS/c1-3-7-18-17(14,15-4-2)16-11-6-5-9(12)8-10(11)13/h5-6,8H,3-4,7H2,1-2H3
33 atoms
Br 4.755235 1.860615 -0.583741
Cl 1.085168 -2.041667 0.676294
S  -3.271801 -1.199895 1.244426
P  -1.95718 0.01287 0.211089
O  -0.71997 0.195956 1.246118
O  -2.615005 1.46342 0.348406
O  -1.577765 -0.451708 -1.133093
C  -3.055907 -2.762746 0.311832
C  -3.93854 -2.843901 -0.920947
C  -3.760289 -4.171278 -1.645388
C  0.503329 0.583908 0.782992
C  -3.754996 1.809655 -0.453042
C  1.465327 -0.376513 0.496376
C  0.811436 1.925404 0.63781
C  -3.350196 2.366653 -1.798841
C  2.734514 -0.000511 0.088534
C  2.075377 2.315477 0.228419
C  3.029443 1.346815 -0.042001
H  -3.310119 -3.543534 1.030765
H  -2.002808 -2.884819 0.061224
H  -4.982633 -2.712925 -0.62804
H  -3.689304 -2.021881 -1.592347
H  -2.733032 -4.299087 -1.988663
H  -4.004621 -5.018339 -1.002242
H  -4.406942 -4.227098 -2.520812
H  -4.411464 0.941311 -0.568766
H  -4.30209 2.550418 0.129867
H  0.056355 2.667078 0.860993
H  -2.70654 3.238737 -1.68786
H  -2.8269 1.623335 -2.3973
H  -4.241525 2.677685 -2.34527
H  3.473831 -0.758739 -0.126666
H  2.306762 3.36572 0.123603
totalener: -4428.04548106 hartree
nucrepener: 2221.79120311 hartree
electener: -6649.83668417 hartree
twoeener: 3905.65710412 hartree
kineticenergy: 4419.47359709 hartree
xcener: -190.172194302992 hartree
chargesum: -0.0000000
charge: -0.018914 -0.058104 -0.152709 0.767261 -0.336004 -0.335159 -0.504693 -0.081077 -0.100105 -0.256494 0.211495 0.033775 0.033141 -0.157533 -0.235583 -0.070644 -0.077181 -0.071061 0.112012 0.103686 0.061432 0.073191 0.087133 0.072705 0.087215 0.071158 0.097506 0.135063 0.080648 0.097988 0.081702 0.120466 0.127684
qa: -0.0189 -0.0581 -0.1527 0.7673 -0.3360 -0.3352 -0.5047 -0.0811 -0.1001 -0.2565 0.2115 0.0338 0.0331 -0.1575 -0.2356 -0.0706 -0.0772 -0.0711 0.1120 0.1037 0.0614 0.0732 0.0871 0.0727 0.0872 0.0712 0.0975 0.1351 0.0806 0.0980 0.0817 0.1205 0.1277
va: 1.2329 1.2550 2.3001 5.5308 2.1400 2.1223 2.0780 3.8694 3.8984 3.9628 3.8981 3.9102 4.0083 4.0486 3.9241 3.9279 3.8979 4.0594 1.0091 1.0313 1.0112 1.0254 1.0022 1.0030 1.0061 1.0097 0.9914 1.0117 1.0057 1.0203 1.0106 1.0121 1.0015
dispcorr: -0.016551329 hartree
energy: -4428.062032389484
dipole: -79.62182 78.53791 -1.08391 -22.73013 23.01828 0.28815 -7.51028 7.46064 -0.04964
magnitude: 1.12266 au
magnitude: 2.85356 debye
