program: Orca
programVersion: 5.0.2
elementType: Br Cl S P O O O C C C C C C C C C C C H H H H H H H H H H H H H H H
charge: 0
multiplicity: 1
keywords: wb97x-d3
keywords: def2-TZVPP
keywords: def2/J RIJCOSX
keywords: DEFGRID2
keywords: scfconv7
keywords: smallprint printgap noloewdin
keywords: NOSOSCF
formula: C11H15BrClO3PS
InChI: InChI=1/C11H15BrClO3PS/c1-3-7-18-17(14,15-4-2)16-11-6-5-9(12)8-10(11)13/h5-6,8H,3-4,7H2,1-2H3
33 atoms
Br 4.264748 1.764673 1.052493
Cl 0.257181 -1.981298 1.437595
S  -3.288892 -1.783204 -1.704078
P  -1.982337 -0.248788 -1.297978
O  -0.549027 -1.029548 -1.222204
O  -2.13952 0.194443 0.231242
O  -2.089437 0.830273 -2.29208
C  -2.895987 -3.065239 -0.45265
C  -3.438673 -2.807963 0.943037
C  -4.948066 -2.640303 0.998389
C  0.531116 -0.372647 -0.709805
C  -2.590485 1.510434 0.590565
C  1.024701 -0.733031 0.538734
C  1.15483 0.638797 -1.423457
C  -1.441418 2.489901 0.64283
C  2.139209 -0.101364 1.066329
C  2.266375 1.282011 -0.904772
C  2.750153 0.9081 0.339448
H  -1.819139 -3.223637 -0.443903
H  -3.347787 -3.963751 -0.878418
H  -3.141925 -3.664358 1.556214
H  -2.943764 -1.94084 1.37909
H  -5.461955 -3.517734 0.601909
H  -5.285239 -2.498171 2.024795
H  -5.275181 -1.776494 0.420004
H  -3.360887 1.852799 -0.103104
H  -3.051655 1.3945 1.570919
H  0.767476 0.916829 -2.394482
H  -0.64921 2.137943 1.303868
H  -1.019917 2.657633 -0.347274
H  -1.79518 3.44917 1.022191
H  2.512556 -0.397813 2.036381
H  2.744378 2.067817 -1.472372
totalener: -4428.04443408 hartree
nucrepener: 2287.40546293 hartree
electener: -6715.44989701 hartree
twoeener: 3970.73888654 hartree
kineticenergy: 4419.46017020 hartree
xcener: -190.173661899345 hartree
chargesum: -0.0000000
charge: -0.014823 -0.061656 -0.131174 0.750761 -0.340794 -0.321809 -0.508575 -0.144145 -0.105601 -0.236979 0.214314 0.034283 0.027247 -0.170714 -0.247765 -0.086157 -0.067515 -0.068022 0.123986 0.117563 0.075651 0.060387 0.076133 0.086635 0.076871 0.096749 0.089039 0.148575 0.082955 0.096255 0.093669 0.121733 0.132921
qa: -0.0148 -0.0617 -0.1312 0.7508 -0.3408 -0.3218 -0.5086 -0.1441 -0.1056 -0.2370 0.2143 0.0343 0.0272 -0.1707 -0.2478 -0.0862 -0.0675 -0.0680 0.1240 0.1176 0.0757 0.0604 0.0761 0.0866 0.0769 0.0967 0.0890 0.1486 0.0830 0.0963 0.0937 0.1217 0.1329
va: 1.2350 1.2492 2.3111 5.5218 2.0981 2.0648 2.1162 3.8847 3.8756 3.9396 3.8329 3.8837 3.9787 3.9980 3.9146 3.9290 3.8752 4.0519 1.0274 1.0073 1.0064 1.0265 1.0044 1.0060 1.0188 1.0031 0.9920 1.0096 1.0024 1.0151 1.0151 1.0122 0.9991
dispcorr: -0.019752587 hartree
energy: -4428.064186667382
dipole: -67.41779 67.22985 -0.18794 -19.31189 19.07655 -0.23534 -4.74698 5.81028 1.06329
magnitude: 1.10512 au
magnitude: 2.80900 debye
